program: Gaussian 09
title: 000052770
version: EM64L-G09RevD.01
frameworkgroup: C1[X(C17H14N2OS)]
method: RPBEPBE
basis: SDD
operation: Freq
keyword: #p
keyword: freq=noraman
keyword: PBEPBE/SDD
title: #p freq=noraman PBEPBE/SDD
converged: YES YES NO NO
title: Mulliken charges:
elementType: S O N N C C C C C C C C C C C C C C C C C H H H H H H H H H H H H H H
charge: 0.255405 -0.194814 -0.102822 -0.097229 -0.491653 0.305530 0.114107 -0.351410 -0.338582 -0.208457 -0.162155 -0.240153 -0.160596 -0.211990 -0.222771 -0.321949 -0.230773 -0.227410 -0.211175 -0.212419 -0.223864 0.255573 0.246139 0.240965 0.281776 0.259470 0.248942 0.260662 0.252914 0.249599 0.263552 0.263758 0.237560 0.237474 0.236795
chargesum: 0.00000
title: Mulliken charges with hydrogens summed into heavy atoms:
elementType: S O N N C C C C C C C C C C C C C C C C C
charge: 0.255405 -0.194814 -0.102822 -0.097229 0.010060 0.305530 0.114107 -0.110444 -0.056807 -0.208457 0.097315 0.008789 0.100066 0.040923 -0.222771 -0.072350 0.032779 0.036347 0.026385 0.025056 0.012930
polarizability: 3.39556760e+02 -2.78503245e+01 1.90156533e+02 -1.41669470e+00 5.62540922e+00 1.50777484e+02
1716.lowfreq: -8.7208 -5.5282 -3.8246 -0.0008 0.0003 0.0009 5.9751 10.5756 20.4942
frequency: 1.3287 10.5362 20.4593 31.5678 37.7738 64.3059 72.4489 81.4381 131.0822 197.8656 207.4810 239.3804 268.9369 285.2536 318.0282 329.2099 381.9681 402.5728 404.2669 427.1818 458.0523 491.5020 521.5737 565.3206 609.8500 613.2026 624.9296 650.7565 663.2836 679.4911 696.0540 720.8150 725.4847 741.5020 758.7296 763.7920 803.2417 826.9244 841.1662 849.9002 853.8140 878.9050 930.4536 947.0010 969.7742 975.0826 981.3901 985.1012 997.8687 1001.4628 1002.9740 1014.3784 1014.9131 1055.9834 1062.4768 1071.7826 1080.2430 1108.1011 1123.7247 1171.3526 1174.0308 1182.7397 1196.5706 1224.7616 1236.8717 1270.5003 1300.8684 1303.9009 1319.6206 1348.5687 1360.6895 1366.1495 1373.3564 1415.4668 1425.9807 1435.4904 1459.1278 1461.7429 1478.6510 1485.6607 1553.0018 1585.4231 1587.2507 1592.8136 1612.9781 2985.9471 3049.4519 3133.1486 3138.6586 3139.3337 3142.5776 3154.2359 3160.4755 3162.8173 3163.8997 3173.3212 3225.5981 3226.7765 3255.8518
redmass: 4.2706 4.3348 7.2138 4.0647 5.3673 5.0989 4.5649 7.3923 6.3435 7.0343 5.6142 6.1788 6.0772 5.2768 3.8171 3.2408 8.0053 2.8586 2.8493 7.6332 3.4640 5.1387 5.2407 2.7042 6.4804 3.1555 7.1491 3.3888 5.7508 6.6930 2.2249 1.3043 3.7738 4.8904 1.5387 1.4488 5.2969 1.4061 1.4435 1.3124 1.2451 6.2929 1.3643 1.9559 5.0781 1.5644 1.3939 6.3960 1.3920 1.3402 3.4224 3.3576 3.2598 1.7413 2.7898 1.5977 2.7242 1.8207 1.3868 1.4598 1.0545 1.1142 1.1708 1.5946 2.4476 1.9058 1.3169 1.3026 1.6229 4.2765 4.0610 3.2462 9.8670 4.3750 2.0716 1.6614 2.0883 1.9062 2.6905 2.6278 7.0558 6.0856 6.3045 6.6980 7.8537 1.0617 1.0985 1.0853 1.0879 1.0881 1.0886 1.0931 1.0953 1.0970 1.0968 1.1016 1.0947 1.0941 1.1096
irintensity: 0.6109 2.0061 0.6211 2.3117 0.8077 1.2672 4.5676 0.0665 3.8246 0.1964 0.2423 0.1074 0.1671 1.5566 4.7944 2.8105 3.8279 0.0234 0.0060 0.3609 7.8775 30.7074 6.2238 12.6062 0.1785 6.7909 1.1193 10.6808 19.4500 7.0081 47.1328 20.8004 1.1919 15.9762 68.1647 73.9327 5.3172 35.7157 3.9010 21.2528 0.2711 13.3597 2.2027 1.9929 82.7103 1.9635 0.0714 13.2472 0.6735 0.1553 27.8599 21.7735 42.2494 33.8892 69.2215 7.9044 22.3890 15.1471 14.6967 3.3240 0.0022 6.8501 66.0570 59.6968 222.8092 19.5848 0.9181 0.9177 22.1537 3.1988 23.4394 2.6059 1.5364 19.8854 11.2603 27.6652 40.8256 41.1763 17.0240 11.8432 107.7651 115.5466 2.0892 290.4972 21.9852 53.4930 4.7019 0.2858 10.6685 0.6047 4.7284 14.8866 9.2126 16.5061 0.2915 16.8176 6.0191 0.6921 2.5039
temp: 298.150 k
press: 1.00000 atm
elementType: 16 8 7 7 6 6 6 6 6 6 6 6 6 6 6 6 6 6 6 6 6 1 1 1 1 1 1 1 1 1 1 1 1 1 1
symmnumber: 1
zpe: 697481.2 jmol-1
zpe.correction: 0.265657 hartree
zpe.thermalcorrener: 0.284098 hartree
zpe.thermalcorrenthalpy: 0.285042 hartree
zpe.thermalcorrgfe: 0.210853 hartree
zpe.sumelectzpe: -1237.513383 hartree
zpe.sumelectthermal: -1237.494942 hartree
zpe.sumelectthermalent: -1237.493998 hartree
zpe.sumelectthermalfe: -1237.568187 hartree
dipole: 8.6381 -2.7519 1.5718
dipole: 9.2012
quadrupole: -170.0434 -126.1027 -122.4384
quadrupole: -13.6635 -11.3964 -0.0488
quadrupole: -30.5153 13.4255 17.0898 -13.6635 -11.3964 -0.0488
hfenergy: -1237.7790401 hartree
pointgroup: C01 [X(C17H14N2O1S1)]
dipole: 3.4120074 -1.0007602 0.6791174 debye
polarizability: 338.7990888|-29.6821335|191.6476617|-3.2456778|-0.6123979|150.0440263 unknown
InChI: InChI=1S/C17H14N2OS/c20-17(12-19-11-10-18-13-19)14-6-8-16(9-7-14)21-15-4-2-1-3-5-15/h1-11,13H,12H2
charge 0 multiplicity 1
35 atoms
S  3.589292 1.756679 -0.596932
O  -3.267056 1.793383 -0.183291
N  -4.479778 -0.676259 0.346017
N  -6.600304 -1.189817 -0.282167
C  -3.025013 -0.594922 0.308755
C  -0.999461 0.970851 -0.146805
C  -2.480344 0.818866 -0.027919
C  -0.085614 -0.101542 0.048208
C  -0.477524 2.255583 -0.473066
C  1.803994 1.379384 -0.402654
C  1.303122 0.096283 -0.07711
C  0.903946 2.462191 -0.601238
C  -5.329338 -0.115257 1.309439
C  -5.297406 -1.306692 -0.596005
C  4.394124 0.136927 -0.219656
C  -6.625734 -0.444296 0.910319
C  4.709473 -0.747371 -1.276805
C  4.753622 -0.171374 1.112678
C  5.38596 -1.957099 -0.99363
C  5.428328 -1.383525 1.388623
C  5.744475 -2.275902 0.337169
H  -2.602405 -0.912798 1.282289
H  -2.655639 -1.311844 -0.44781
H  -0.442976 -1.105629 0.301283
H  -1.184768 3.07818 -0.622118
H  1.990788 -0.740598 0.077104
H  1.288625 3.456399 -0.853656
H  -4.951678 0.470351 2.142894
H  -4.897456 -1.82495 -1.465151
H  -7.565639 -0.190833 1.394668
H  4.431691 -0.489549 -2.303718
H  4.51183 0.529198 1.918305
H  5.633832 -2.64315 -1.810627
H  5.709732 -1.624582 2.41932
H  6.271596 -3.211686 0.552987
