program: Gaussian 09
title: 000052764
version: EM64L-G09RevD.01
frameworkgroup: C1[X(C14H16N2OS)]
method: RPBEPBE
basis: SDD
operation: Freq
keyword: #p
keyword: freq=noraman
keyword: PBEPBE/SDD
title: #p freq=noraman PBEPBE/SDD
converged: YES YES NO NO
title: Mulliken charges:
elementType: S O N N C C C C C C C C C C C C C C H H H H H H H H H H H H H H H H
charge: 0.231820 -0.195094 -0.102968 -0.097093 -0.490200 0.304979 0.113105 -0.173142 -0.664957 -0.323654 -0.366993 -0.340127 -0.176694 -0.250605 -0.160239 -0.212468 -0.665767 -0.322205 0.245412 0.254786 0.245956 0.264361 0.232706 0.226658 0.239775 0.281719 0.236882 0.250517 0.260766 0.207941 0.228373 0.213954 0.252864 0.249633
chargesum: 0.00000
title: Mulliken charges with hydrogens summed into heavy atoms:
elementType: S O N N C C C C C C C C C C C C C C
charge: 0.231820 -0.195094 -0.102968 -0.097093 0.009999 0.304979 0.113105 -0.173142 -0.154640 0.135710 -0.127218 -0.058408 0.060188 -0.000089 0.100527 0.040395 -0.015499 -0.072572
polarizability: 3.19440807e+02 9.88996949e+00 1.55125982e+02 -9.85270851e+00 -1.12941389e+01 1.19933555e+02
1716.lowfreq: -5.0900 -0.0010 -0.0008 -0.0005 4.0621 6.7900 15.2470 23.9421 28.0235
frequency: 14.7728 23.4923 27.8241 43.7840 61.4431 73.5089 81.3157 112.7166 133.6170 201.3227 208.7773 221.9718 245.6338 250.2471 287.4017 313.8522 328.9172 386.4693 403.4538 408.9015 460.3364 508.9433 566.5743 613.7107 626.1245 651.2722 663.1216 682.1617 720.5202 723.9769 738.8433 744.2760 763.6480 803.4321 814.2521 841.7774 846.8103 851.3511 878.9071 895.8889 940.6565 966.2856 970.4339 998.9583 1003.6469 1014.9820 1041.4545 1057.1773 1066.2783 1074.4489 1103.1274 1108.4249 1128.0938 1170.2746 1199.3099 1217.6137 1225.3791 1238.6019 1250.6080 1271.2199 1287.3114 1305.5170 1317.7026 1332.7838 1348.9589 1359.1257 1365.9511 1391.0227 1418.4738 1435.6836 1455.2445 1462.6850 1475.7193 1477.5170 1480.5878 1486.5522 1488.0114 1550.5648 1592.5987 1613.3477 2977.8738 2985.4022 3001.6026 3020.3214 3045.1415 3049.0242 3073.3826 3082.7578 3092.5872 3137.1704 3139.3206 3162.4871 3166.0695 3225.5045 3226.7401 3255.8450
redmass: 4.1505 7.2870 4.0409 3.4482 4.7659 3.2062 5.5136 2.5327 3.3930 2.5557 7.4227 1.6168 4.0216 2.6437 4.3391 3.9807 2.8183 7.0827 2.9741 4.9268 3.4696 6.6670 2.6713 3.1454 7.0449 3.3948 5.3602 4.8344 1.3056 3.8287 1.1494 4.5155 1.4476 5.0361 1.4136 1.4391 1.2307 1.3322 6.3036 1.9385 1.6757 1.8917 4.5679 1.3884 3.3627 3.2343 2.8623 1.7356 1.2745 3.5196 2.1534 1.8105 1.3739 1.4479 1.2044 1.3567 1.5571 2.3642 1.2196 1.9089 1.1021 1.3213 1.6424 1.3964 4.2597 4.0224 3.1345 1.2029 4.2285 1.6647 1.1323 1.8072 1.0427 1.0440 2.8551 2.3145 1.1198 6.7226 7.0786 7.5438 1.0358 1.0617 1.0608 1.0587 1.1006 1.0985 1.1015 1.0992 1.1052 1.0876 1.0886 1.0950 1.0956 1.0951 1.0937 1.1096
irintensity: 1.4552 0.5679 1.7125 1.5431 1.5527 3.7690 0.9256 0.5486 1.3074 1.6833 0.5903 0.7520 0.4874 0.3650 2.7569 3.7280 1.8654 2.0712 0.8643 2.6241 8.4628 24.4333 14.6765 7.5645 0.7811 11.3377 16.2867 13.6598 20.6054 1.0996 5.4228 29.4953 69.0110 6.3805 35.4410 4.0937 1.3370 25.8267 13.4751 13.3755 0.8618 12.4992 55.2210 0.7121 17.1033 48.4804 2.4603 30.1732 3.7088 127.7653 8.2790 14.8979 11.8750 3.3588 112.4388 1.9285 39.2592 199.3055 8.6703 18.4424 0.1443 1.9145 23.5459 5.4957 3.4699 25.2081 2.6356 12.1677 19.4607 28.2849 17.0633 37.9993 4.6830 11.2774 19.8732 9.3314 16.9456 100.5261 380.6187 27.7381 36.2308 52.6774 8.2168 31.7201 0.1490 4.8239 28.0369 35.2744 43.3986 13.0615 1.2375 10.7403 6.2304 5.7370 0.9496 2.4712
temp: 298.150 k
press: 1.00000 atm
elementType: 16 8 7 7 6 6 6 6 6 6 6 6 6 6 6 6 6 6 1 1 1 1 1 1 1 1 1 1 1 1 1 1 1 1
symmnumber: 1
zpe: 709139.8 jmol-1
zpe.correction: 0.270097 hartree
zpe.thermalcorrener: 0.287939 hartree
zpe.thermalcorrenthalpy: 0.288883 hartree
zpe.thermalcorrgfe: 0.220168 hartree
zpe.sumelectzpe: -1124.543406 hartree
zpe.sumelectthermal: -1124.525564 hartree
zpe.sumelectthermalent: -1124.524620 hartree
zpe.sumelectthermalfe: -1124.593335 hartree
dipole: 8.6294 3.4103 0.5715
dipole: 9.2964
quadrupole: -145.2559 -113.7684 -112.4890
quadrupole: 5.1483 -9.4089 -0.9961
quadrupole: -21.4181 10.0694 11.3488 5.1483 -9.4089 -0.9961
hfenergy: -1124.813503 hartree
pointgroup: C01 [X(C14H16N2O1S1)]
dipole: 3.3369442 -1.449684 0.3746903 debye
polarizability: 319.1338932|-13.6672093|137.640596|7.2410938|-21.1802795|137.7258551 unknown
InChI: InChI=1S/C14H16N2OS/c1-2-9-18-13-5-3-12(4-6-13)14(17)10-16-8-7-15-11-16/h3-8,11H,2,9-10H2,1H3
charge 0 multiplicity 1
34 atoms
S  4.543281 0.963778 -0.587183
O  -2.279655 1.295148 -1.215921
N  -3.759701 -0.419197 0.434143
N  -5.889271 0.004651 1.097716
C  -2.304006 -0.48343 0.469912
C  -0.111418 0.57304 -0.445324
C  -1.603498 0.537667 -0.466022
C  2.737212 0.734752 -0.48978
C  5.236983 -0.433709 0.487119
C  5.195975 -1.81445 -0.19206
C  0.681003 -0.2787 0.372189
C  0.554157 1.509199 -1.288663
C  2.08697 -0.202728 0.352269
C  1.953069 1.591174 -1.31395
C  -4.592635 -0.799981 -0.626967
C  -4.591593 0.067169 1.446507
C  5.785076 -2.912594 0.72341
C  -5.895346 -0.537414 -0.200176
H  -1.973696 -0.302977 1.509779
H  -1.96259 -1.50206 0.198959
H  4.707937 -0.422249 1.45644
H  6.277491 -0.113707 0.672331
H  4.155688 -2.071506 -0.466672
H  5.765639 -1.766389 -1.138658
H  0.213225 -1.013823 1.036229
H  -0.058417 2.163714 -1.917409
H  2.66378 -0.870958 0.998249
H  2.447058 2.317085 -1.969119
H  -4.197629 -1.180672 -1.564647
H  5.210117 -3.006819 1.663909
H  5.766329 -3.894094 0.217038
H  6.835151 -2.691372 0.990728
H  -4.205632 0.439328 2.393361
H  -6.826554 -0.695375 -0.738837
