program: Gaussian 09
title: 000052813
version: EM64L-G09RevD.01
frameworkgroup: C1[X(C21H19ClN2)]
method: RPBEPBE
basis: SDD
operation: Freq
keyword: #p
keyword: freq=noraman
keyword: PBEPBE/SDD
title: #p freq=noraman PBEPBE/SDD
converged: YES YES NO NO
title: Mulliken charges:
elementType: Cl N N C C C C C C C C C C C C C C C C C C C C C H H H H H H H H H H H H H H H H H H H
charge: -0.055162 -0.242183 -0.262928 -0.265070 -0.437563 -0.403840 0.607823 0.415631 0.416888 -0.422720 -0.345576 -0.379887 -0.379645 -0.320580 -0.349558 -0.211468 -0.221382 -0.230260 -0.229077 -0.230566 -0.234738 -0.116975 -0.266370 -0.266665 0.261530 0.243662 0.222343 0.227950 0.234344 0.230926 0.239669 0.233267 0.237648 0.213199 0.244568 0.254467 0.252772 0.220435 0.219908 0.221214 0.220422 0.226964 0.226583
chargesum: 0.00000
title: Mulliken charges with hydrogens summed into heavy atoms:
elementType: Cl N N C C C C C C C C C C C C C C C C C C C C C
charge: -0.055162 -0.242183 -0.262928 -0.003541 0.028443 0.058454 0.607823 0.415631 0.416888 -0.191793 -0.105907 -0.146620 -0.141997 -0.107381 -0.104991 0.042999 0.031390 -0.009825 -0.009170 -0.009352 -0.014316 -0.116975 -0.039405 -0.040082
polarizability: 3.07286415e+02 -3.03252196e+00 2.38324733e+02 6.69678049e+00 2.68901133e+01 2.08388139e+02
1716.lowfreq: -8.9351 -3.5423 -0.0023 -0.0019 -0.0016 4.8168 14.7550 22.4737 27.2609
frequency: 13.0788 22.4450 27.2377 51.0168 68.7663 77.5391 95.3357 109.6467 144.4546 158.5472 184.5851 195.8707 216.6608 250.8894 269.9256 280.7446 310.4482 340.4195 403.6259 406.9942 408.2349 411.7195 413.0612 458.5100 491.3969 505.7312 511.3276 575.2141 613.1654 614.3615 623.8427 643.4781 649.0505 674.3209 690.6215 690.7303 720.0316 752.4918 754.1233 774.9349 803.3192 810.2605 814.2432 827.3397 835.7884 868.8366 869.6026 871.9353 911.1446 947.0657 954.7889 956.0632 962.5441 968.0100 973.5674 976.3051 977.9749 982.2673 986.4281 999.3234 1023.3431 1030.2582 1035.4015 1072.1415 1086.0229 1088.9153 1098.1569 1108.5291 1166.3232 1169.8230 1172.4895 1175.5636 1179.8223 1192.6809 1195.4187 1200.1938 1202.6211 1232.8848 1282.7558 1293.0594 1321.9128 1327.6303 1330.2767 1332.2999 1347.1466 1361.0665 1378.3592 1383.1869 1386.3540 1390.0844 1405.3694 1448.7617 1451.4996 1473.9448 1487.7625 1498.8018 1499.6875 1506.4617 1579.1356 1580.5668 1589.8005 1597.2610 1619.1596 1624.8555 2915.0987 2926.0908 2942.6491 3011.4980 3044.0897 3122.3273 3123.9587 3124.1551 3130.4415 3130.9463 3143.3694 3151.4434 3152.8941 3158.8854 3160.2950 3168.6225 3170.6440 3170.8142 3171.7724
redmass: 3.8230 6.7559 6.6678 3.6563 4.2439 4.7688 5.5767 3.4989 5.1089 5.1129 4.6339 2.2982 5.3159 5.9742 5.5333 6.5167 4.8468 5.6279 4.1038 3.8928 3.6999 2.9671 3.3053 4.7325 3.8003 2.8103 2.9402 3.6575 6.3921 6.4269 7.0992 6.6640 4.3548 6.0991 1.8605 1.8450 3.6178 1.8521 1.8364 2.3206 3.3744 1.3012 1.3641 1.2517 1.7800 1.5234 1.5786 4.4513 1.6571 1.3855 1.3876 1.3658 1.3919 5.3306 2.0265 1.5065 1.7418 5.0123 3.5515 4.0913 2.2724 2.0577 2.0415 2.8398 1.6724 1.6846 1.6045 1.3709 2.9570 1.3516 1.0906 1.5001 1.2122 1.4037 1.1730 1.2404 2.0671 1.4841 1.2735 1.3207 1.5436 1.4819 1.3654 1.6035 1.4981 2.5382 3.2529 5.2851 5.6330 4.9988 2.0085 2.5955 2.5888 2.3731 1.3676 1.5061 1.3870 2.3197 6.0888 6.1486 7.1662 6.3529 6.1461 6.1408 1.0839 1.0717 1.0639 1.0973 1.0938 1.0891 1.0846 1.0849 1.0884 1.0887 1.0884 1.0920 1.0919 1.0941 1.0943 1.0953 1.0998 1.0997 1.0963
irintensity: 0.1450 0.0662 0.0829 0.3821 0.3608 0.4304 0.5145 2.9278 0.6200 5.1708 0.3965 0.8749 0.0665 0.2906 0.6829 4.9173 2.8497 0.3698 3.4177 10.3501 5.7083 0.4214 5.3529 17.9760 16.4017 5.0950 12.0102 23.0627 1.3174 0.1769 0.3478 0.4874 0.8592 5.0655 70.8907 6.7940 5.5721 15.2215 143.7298 10.0586 66.3629 2.3951 13.3192 1.3361 43.4669 4.2344 13.0858 3.0856 12.9220 0.3008 0.1678 0.1747 0.3038 0.3304 1.6832 2.0828 0.2286 2.0760 43.5483 38.7338 1.3367 27.1370 5.4508 47.2406 2.6256 1.6898 6.7939 17.8975 18.8037 1.3645 2.9243 2.7847 3.8345 29.9198 11.6589 23.8327 47.1503 65.8819 12.2986 25.2776 17.8571 2.8043 0.7789 52.2068 14.1528 310.1760 28.7655 5.0807 2.4011 4.2503 16.3132 0.1081 0.9049 60.6442 245.9303 112.7071 61.7616 23.7004 3.0934 16.5457 3.7648 19.2460 349.4279 38.9953 33.3913 54.2673 61.0619 40.3822 34.9635 17.7640 8.1707 6.3918 7.0228 10.7813 5.2336 33.7555 35.5092 44.2030 33.5471 5.9482 7.6875 4.8669 0.5165
temp: 298.150 k
press: 1.00000 atm
elementType: 17 7 7 6 6 6 6 6 6 6 6 6 6 6 6 6 6 6 6 6 6 6 6 6 1 1 1 1 1 1 1 1 1 1 1 1 1 1 1 1 1 1 1
symmnumber: 1
zpe: 901680.3 jmol-1
zpe.correction: 0.343432 hartree
zpe.thermalcorrener: 0.363656 hartree
zpe.thermalcorrenthalpy: 0.364600 hartree
zpe.thermalcorrgfe: 0.291556 hartree
zpe.sumelectzpe: -1379.504689 hartree
zpe.sumelectthermal: -1379.484465 hartree
zpe.sumelectthermalent: -1379.483521 hartree
zpe.sumelectthermalfe: -1379.556565 hartree
dipole: -0.2672 -2.3135 -1.1630
dipole: 2.6031
quadrupole: -150.6587 -157.4711 -132.7359
quadrupole: -0.5575 2.7210 11.8135
quadrupole: -3.7035 -10.5159 14.2193 -0.5575 2.7210 11.8135
hfenergy: -1379.8481209 hartree
pointgroup: C01 [X(C21H19Cl1N2)]
dipole: 0.0036554 -0.9118752 0.4662113 debye
polarizability: 307.0873333|-6.1548593|238.111121|0.9448645|-27.6460139|208.8008328 unknown
InChI: InChI=1S/C21H19ClN2/c22-18-13-11-17(12-14-18)21-23(19-7-3-1-4-8-19)15-16-24(21)20-9-5-2-6-10-20/h1-14,21H,15-16H2
charge 0 multiplicity 1
43 atoms
Cl -0.403536 5.597296 0.468246
N  -1.053683 -1.248701 0.491442
N  1.242419 -1.110805 0.522421
C  0.068422 -0.53491 -0.164732
C  -0.637118 -1.805869 1.785671
C  0.867661 -2.072098 1.575249
C  -0.021714 0.997205 -0.015635
C  -2.390372 -1.188967 0.071984
C  2.536307 -1.059184 -0.017187
C  -0.389037 1.808658 -1.114419
C  0.243037 1.615554 1.231297
C  -3.443975 -1.566458 0.959064
C  3.586351 -1.842639 0.551236
C  -2.741037 -0.789773 -1.253406
C  2.845167 -0.22878 -1.137571
C  -0.510686 3.210232 -0.979298
C  0.125557 3.011681 1.389675
C  -4.785802 -1.559154 0.526603
C  4.888883 -1.794128 0.014453
C  -4.086756 -0.781909 -1.669018
C  4.152024 -0.19451 -1.663427
C  -0.255158 3.788756 0.276884
C  -5.124647 -1.167321 -0.788466
C  5.187737 -0.974118 -1.097675
H  0.088661 -0.784473 -1.249846
H  -1.183768 -2.740795 2.00046
H  -0.815314 -1.102994 2.629074
H  1.447113 -1.901856 2.50271
H  1.045659 -3.11792 1.245642
H  -0.576401 1.354876 -2.095225
H  0.570644 1.003605 2.078466
H  -3.219691 -1.850402 1.992099
H  3.388057 -2.491958 1.409448
H  -1.963358 -0.505286 -1.967708
H  2.075856 0.410056 -1.58033
H  -0.794603 3.835477 -1.8304
H  0.334553 3.489176 2.351343
H  -5.573195 -1.853417 1.230332
H  5.675596 -2.406792 0.470111
H  -4.324721 -0.474873 -2.694141
H  4.362237 0.454571 -2.521482
H  -6.168692 -1.157443 -1.117344
H  6.201021 -0.94061 -1.510701
