program: Gaussian 09
title: 000052760
version: EM64L-G09RevD.01
frameworkgroup: C1[X(C16H20N2O)]
method: RPBEPBE
basis: SDD
operation: Freq
keyword: #p
keyword: freq=noraman
keyword: PBEPBE/SDD
title: #p freq=noraman PBEPBE/SDD
converged: YES YES NO NO
title: Mulliken charges:
elementType: O N N C C C C C C C C C C C C C C C C H H H H H H H H H H H H H H H H H H H H
charge: -0.153583 -0.085516 -0.096713 0.065995 0.135738 0.125667 0.189412 0.198534 0.182666 -0.021618 -0.852153 -0.858937 -0.509286 -0.871093 -0.863483 -0.859384 -0.161078 -0.192167 -0.320847 0.229442 0.245786 0.258214 0.246445 0.232996 0.248889 0.261971 0.277485 0.236408 0.239879 0.254432 0.247869 0.239554 0.241558 0.241035 0.249101 0.239864 0.254410 0.252423 0.250086
chargesum: 0.00000
title: Mulliken charges with hydrogens summed into heavy atoms:
elementType: O N N C C C C C C C C C C C C C C C C
charge: -0.153583 -0.085516 -0.096713 0.065995 0.135738 0.125667 0.189412 0.198534 0.182666 -0.021618 -0.118711 -0.130607 0.030170 -0.140374 -0.134501 -0.129384 0.093332 0.060256 -0.070761
polarizability: 2.50073310e+02 1.60137778e+00 1.98020277e+02 -1.60547536e+01 4.90229294e+00 1.15230875e+02
1716.lowfreq: -0.0006 -0.0006 0.0004 3.3565 6.6869 10.3082 16.7098 27.6119 41.5489
frequency: 15.9229 27.4621 41.4310 51.2642 54.0555 90.9685 104.3058 108.1225 137.2287 149.4738 158.1461 170.6109 185.7755 195.5227 226.8760 277.3631 290.2110 329.6106 342.7728 346.3405 352.4481 367.0782 395.7913 425.9514 442.6248 493.8064 495.1467 561.2501 580.0438 597.3662 609.0428 615.8740 651.2505 670.9873 718.6438 748.4880 767.1187 769.7549 810.1857 812.5302 841.7470 878.6171 917.1946 939.2742 989.9748 991.7156 1003.4474 1011.9663 1020.0734 1031.1874 1034.9805 1046.8539 1054.6975 1055.6679 1076.7711 1082.7139 1093.3138 1107.9175 1108.0624 1162.3856 1223.4738 1260.2646 1269.2218 1307.3318 1325.7741 1343.3209 1348.0944 1358.2753 1393.2064 1396.8981 1401.4840 1406.2112 1406.5800 1411.8067 1420.7184 1425.9821 1452.2208 1457.1087 1459.7270 1469.1180 1471.2441 1480.8409 1481.9129 1483.6341 1491.2128 1495.3365 1506.0364 1514.2480 1579.0777 1586.0601 1629.6551 2970.6126 2971.1054 2972.4849 2976.0415 2979.6862 2995.8504 3049.3777 3049.9172 3051.7845 3053.0661 3053.3929 3059.4775 3081.0657 3100.1382 3101.1326 3104.4646 3112.4148 3222.4794 3227.0484 3250.9534
redmass: 5.4546 3.8348 3.4562 1.4654 2.2997 3.0909 2.2898 1.8719 1.5389 1.4796 3.6965 1.9594 1.3275 1.3839 1.8285 4.3995 5.8522 2.2779 2.7058 2.5729 3.1341 2.4671 2.3338 4.9236 4.7091 3.6440 3.8541 4.2860 3.3270 4.0509 2.7110 3.2018 3.3502 4.3249 1.2865 3.2543 2.5613 1.8015 4.2944 2.8915 1.4464 6.2869 3.2150 2.3640 1.4658 1.5120 1.3729 3.3613 1.4122 2.0509 1.5303 1.5880 1.7449 1.6812 2.0405 2.4487 2.0002 2.0990 2.9331 1.4219 1.5326 5.6064 1.8822 1.6799 4.9692 4.4682 6.2187 3.6330 1.2671 1.2151 1.2645 1.2263 1.7959 1.8452 3.3497 1.3658 1.1755 2.0390 1.1250 1.1367 1.0697 2.8609 1.0815 1.1927 1.1288 1.0643 1.0581 1.0622 6.2819 5.9746 9.9949 1.0415 1.0440 1.0445 1.0427 1.0405 1.0606 1.0944 1.0996 1.0923 1.0932 1.0967 1.0898 1.0980 1.0966 1.0962 1.0967 1.0943 1.0910 1.0972 1.1100
irintensity: 0.3112 1.7321 0.2970 2.8563 3.8758 0.9281 0.3542 0.1562 0.6686 2.1132 0.1914 0.1845 0.6972 2.4725 1.7236 2.0699 7.8366 1.0561 0.1923 0.8993 0.5345 0.2731 0.0266 0.4953 0.1762 0.4626 3.7639 0.6950 0.7470 6.4969 0.5364 5.9634 12.6266 27.1182 28.4656 6.8046 23.6244 40.1902 0.6048 0.4624 4.1851 10.8138 36.4827 7.0151 1.1605 3.0272 11.1163 35.9116 0.3781 9.8293 3.8705 1.7689 3.6056 22.9820 9.9008 8.0222 3.7912 27.6176 39.7986 2.3317 26.0406 14.2587 37.5121 20.3986 44.0797 3.5083 0.6102 2.2597 0.8845 3.4564 15.3612 33.0710 15.5179 1.0401 1.8557 39.6061 3.5225 42.6321 4.5087 12.7241 38.1020 17.2671 7.4010 31.3712 26.4589 2.4989 2.8289 1.1124 0.8261 9.4597 97.7421 38.1464 50.9225 9.3331 27.4590 22.9084 33.0327 31.8420 6.1620 30.9855 0.2699 14.5348 7.8596 26.8628 19.8780 38.5143 1.5779 9.7980 2.4606 2.7216 4.2193
temp: 298.150 k
press: 1.00000 atm
elementType: 8 7 7 6 6 6 6 6 6 6 6 6 6 6 6 6 6 6 6 1 1 1 1 1 1 1 1 1 1 1 1 1 1 1 1 1 1 1 1
symmnumber: 1
zpe: 845018.0 jmol-1
zpe.correction: 0.321850 hartree
zpe.thermalcorrener: 0.341965 hartree
zpe.thermalcorrenthalpy: 0.342909 hartree
zpe.thermalcorrgfe: 0.271210 hartree
zpe.sumelectzpe: -805.015221 hartree
zpe.sumelectthermal: -804.995107 hartree
zpe.sumelectthermalent: -804.994163 hartree
zpe.sumelectthermalfe: -805.065861 hartree
dipole: 7.1435 1.8844 -2.5685
dipole: 7.8216
quadrupole: -135.7836 -101.0987 -120.2176
quadrupole: -9.6518 0.2469 3.1602
quadrupole: -16.7503 17.9346 -1.1843 -9.6518 0.2469 3.1602
hfenergy: -805.3370718 hartree
pointgroup: C01 [X(C16H20N2O1)]
dipole: 2.7835485 -0.8728711 0.9794974 debye
polarizability: 250.1166412|-3.9842277|198.2196377|14.971329|4.6839244|114.9881832 unknown
InChI: InChI=1S/C16H20N2O/c1-10-11(2)13(4)16(14(5)12(10)3)15(19)8-18-7-6-17-9-18/h6-7,9H,8H2,1-5H3
charge 0 multiplicity 1
39 atoms
O  -1.37873 0.542604 -1.594668
N  -3.13753 0.096453 0.590372
N  -5.245039 0.931945 0.468164
C  0.639195 0.070833 -0.287816
C  1.455833 1.232474 -0.176596
C  1.180765 -1.240869 -0.173693
C  2.851385 1.069701 0.066363
C  2.573486 -1.392367 0.073886
C  3.406086 -0.239243 0.180996
C  -0.851131 0.233671 -0.499309
C  0.846625 2.623991 -0.306315
C  0.289993 -2.464134 -0.367299
C  -1.694804 0.046094 0.789041
C  3.75537 2.288316 0.203522
C  3.184226 -2.779637 0.215863
C  4.899721 -0.420376 0.41512
C  -3.946273 -0.927893 0.076716
C  -3.968196 1.199285 0.798587
C  -5.236531 -0.398969 0.014517
H  0.952566 3.203641 0.63074
H  1.343601 3.204832 -1.104687
H  -0.223053 2.589585 -0.564847
H  -0.701432 -2.19509 -0.768942
H  0.137429 -3.023611 0.576765
H  0.737227 -3.169494 -1.090161
H  -1.393343 0.85163 1.487319
H  -1.397797 -0.902091 1.274146
H  4.381279 2.227382 1.112458
H  4.445709 2.378656 -0.65824
H  3.183687 3.226253 0.260249
H  2.425762 -3.548196 0.431136
H  3.926041 -2.810878 1.033132
H  3.711589 -3.088572 -0.709164
H  5.294122 -1.288474 -0.140475
H  5.477909 0.462413 0.10171
H  5.123331 -0.595017 1.487137
H  -3.545492 -1.901122 -0.195127
H  -3.598551 2.14588 1.187439
H  -6.149235 -0.882906 -0.324838
