program: Orca
programVersion: 6.0.x
elementType: C C C C C C H H H H C H C C C C H C H C H H H C C C H
charge: 1
multiplicity: 1
keywords: wB97X-D3 def2-TZVPPD autoaux TightSCF
formula: C16H11
InChI: InChI=1/C16H11/c1-2-12-8-10-14(11-9-12)16-15(17-16)13-6-4-3-5-7-13/h1,3-11H
27 atoms
C  3.439682 -2.782253 -0.632651
C  3.866721 -1.467403 -0.888328
C  2.975749 -0.413928 -0.792705
C  1.641771 -0.6707 -0.433625
C  1.202455 -1.980816 -0.179432
C  2.101219 -3.027469 -0.278564
H  4.900689 -1.285402 -1.156967
H  3.305213 0.601405 -0.985074
H  0.170867 -2.169458 0.09776
H  1.780044 -4.043574 -0.081458
C  0.730191 0.423717 -0.307256
H  -0.043851 0.785534 -1.265909
C  -0.838156 2.535015 0.15903
C  -2.070473 2.337794 0.804628
C  -0.39883 3.822027 -0.195244
C  -2.858251 3.440689 1.099415
H  -2.393018 1.337483 1.073182
C  -1.200176 4.912388 0.108557
H  0.556739 3.95743 -0.690576
C  -2.424052 4.720859 0.751898
H  -3.809677 3.304664 1.600726
H  -0.872553 5.912004 -0.153486
H  -3.04491 5.578889 0.987171
C  -0.005316 1.408131 -0.122056
C  4.364721 -3.865194 -0.731263
C  5.148635 -4.779124 -0.814229
H  5.845259 -5.586113 -0.886407
totalener: -615.93428032583915 hartree
nucrepener: 842.15849540984414 hartree
electener: -1458.09280215824151 hartree
oneelecener: -2484.14688005137350 hartree
twoeener: 1026.05407789313199 hartree
kineticenergy: 612.79452367077488 hartree
xcener: -62.172101784784 hartree
energy: -286.7903 -286.7151 -284.9057 -284.8845 -284.5095 -284.1688 -284.1680 -284.1661 -284.1653 -283.8228 -283.7074 -283.7052 -283.6546 -283.6532 -282.8695 -282.8018 -32.1438 -30.9938 -30.5313 -28.7167 -27.9459 -27.6695 -27.6230 -26.4997 -24.7623 -24.1611 -23.7053 -23.5799 -21.9225 -21.6361 -21.1778 -20.4087 -19.9500 -19.6924 -19.5455 -19.3027 -18.5323 -18.4339 -18.2393 -18.2161 -17.3723 -16.8561 -16.8195 -16.6444 -16.1890 -16.0196 -15.5281 -14.8322 -13.5084 -13.3601 -13.3130 -13.2494 -12.2230 -4.5364 -2.9817 -2.2798 -2.2439 -2.1666 -2.0079 -0.8635 -0.8562 -0.7618 -0.5299 -0.3094 electronvolt
chargesum: 1.0000000
charge: 0.284930 -0.473916 -0.152912 0.459217 -0.184955 -0.431007 0.134155 0.113694 0.113243 0.136621 0.383426 0.253224 0.463866 -0.426531 -0.437638 -0.159533 0.110303 -0.149736 0.116865 -0.144591 0.166868 0.160631 0.162537 0.445894 0.305326 -0.353659 0.103677
charge: -0.174429 0.087660 0.087326 -0.173641 0.086609 0.087420 0.031128 0.029874 0.029668 0.031060 0.161126 0.124520 -0.176974 0.079933 0.079033 0.053488 0.028376 0.053218 0.028125 0.066208 0.020147 0.020160 0.022554 0.167603 -0.053089 0.261908 -0.059010
qa: 0.2849 -0.4739 -0.1529 0.4592 -0.1850 -0.4310 0.1342 0.1137 0.1132 0.1366 0.3834 0.2532 0.4639 -0.4265 -0.4376 -0.1595 0.1103 -0.1497 0.1169 -0.1446 0.1669 0.1606 0.1625 0.4459 0.3053 -0.3537 0.1037
va: 1.4821 3.1105 2.8462 1.1310 2.9103 3.0825 0.9715 0.9658 0.9751 0.9667 2.5778 0.9033 1.0489 3.1980 3.1833 3.3425 0.9892 3.3359 0.9866 3.3691 0.9206 0.9267 0.9331 2.4331 1.0980 3.6302 1.0246
dispcorr: -0.008129064 hartree
energy: -615.942409389873
