program: Gaussian 09
title: 000052768
version: EM64L-G09RevD.01
frameworkgroup: C1[X(C17H14N2OS)]
method: RPBEPBE
basis: SDD
operation: Freq
keyword: #p
keyword: freq=noraman
keyword: PBEPBE/SDD
title: #p freq=noraman PBEPBE/SDD
converged: YES YES NO NO
title: Mulliken charges:
elementType: S O N N C C C C C C C C C C C C C C C C C H H H H H H H H H H H H H H
charge: 0.190517 -0.200467 -0.111866 -0.098896 -0.470989 0.342838 0.127813 -0.371002 -0.323449 -0.150972 -0.157027 -0.237224 -0.215339 -0.250394 -0.194853 -0.325270 -0.224979 -0.238684 -0.211678 -0.209903 -0.222877 0.272271 0.250791 0.284098 0.261473 0.264301 0.240742 0.254061 0.237627 0.248999 0.263847 0.262977 0.237994 0.238279 0.237243
chargesum: 0.00000
title: Mulliken charges with hydrogens summed into heavy atoms:
elementType: S O N N C C C C C C C C C C C C C C C C C
charge: 0.190517 -0.200467 -0.111866 -0.098896 0.052073 0.342838 0.127813 -0.371002 -0.039351 0.110501 0.107274 0.003517 0.038722 -0.012767 -0.194853 -0.076271 0.038868 0.024292 0.026316 0.028377 0.014366
polarizability: 3.10118732e+02 -1.08356117e+01 1.95242168e+02 -9.48880227e+00 5.36410892e+00 1.52804189e+02
1716.lowfreq: -7.7436 -0.0017 -0.0009 0.0003 0.6699 5.4861 8.2083 13.2231 25.5254
frequency: 5.0343 12.8691 25.4746 33.2717 51.0753 72.8327 74.8043 115.7604 131.5671 188.1604 210.0486 223.7947 265.9651 270.8744 331.7983 343.0835 390.6955 403.1882 419.1272 424.1215 470.1142 487.8068 525.3953 569.1889 609.4404 611.4652 625.2285 651.6137 666.7952 678.5191 695.3116 724.7518 726.6970 736.1693 758.4624 763.7778 771.6174 814.3873 841.7477 852.5420 878.3741 885.8914 930.5590 949.0572 975.1408 979.3086 982.5282 984.8813 1002.1571 1003.5136 1009.5231 1013.6086 1021.6621 1055.3572 1063.2993 1071.9621 1073.6755 1107.9037 1120.4364 1171.8371 1174.3755 1178.0534 1182.9422 1208.7086 1224.4815 1264.7758 1268.9978 1301.1953 1319.4994 1348.9927 1363.7851 1368.1167 1373.6788 1415.3434 1426.2285 1429.9931 1445.7008 1458.6486 1462.1877 1481.8023 1559.0385 1576.5991 1586.0084 1587.1907 1604.4955 2979.8279 3052.9059 3134.0138 3136.7143 3143.3243 3150.7384 3154.8656 3162.2129 3163.3004 3172.8728 3173.9691 3226.0465 3228.6218 3260.0259
redmass: 6.3990 6.5371 4.5109 4.3703 5.8107 4.4130 5.5309 4.5716 6.6079 5.6624 4.6859 6.4028 5.8422 5.9379 5.3079 2.7741 5.5978 2.8148 4.1549 11.8312 4.6542 3.8930 4.9479 2.9420 6.4782 3.7755 4.6000 3.4363 5.9929 6.6308 2.2290 1.3025 3.6326 5.3054 1.5215 1.3920 1.2645 5.2267 1.4624 1.2444 6.2584 1.3530 1.3646 2.3794 4.4049 1.4388 1.4176 6.3224 1.3268 1.3638 4.3273 3.5760 4.7785 1.7622 2.0009 1.7169 2.1789 1.7830 1.9156 1.4904 1.0547 1.0646 1.1144 2.2718 1.5471 1.5173 1.9497 1.3167 1.7316 4.6237 6.6061 2.6572 9.8405 2.0604 2.0638 1.5670 2.3268 2.0847 1.9014 3.6041 6.3640 7.5044 5.9830 6.3061 6.8681 1.0636 1.0967 1.0853 1.0860 1.0886 1.0894 1.0930 1.0937 1.0970 1.1007 1.1015 1.0959 1.0936 1.1089
irintensity: 0.0216 0.9369 2.0846 0.2071 0.4760 6.6819 0.1721 0.6297 1.0853 2.3406 0.6650 1.3869 0.2150 0.6418 8.2004 1.2897 3.5544 0.0734 5.5174 2.6018 5.9959 4.8892 14.5147 2.3817 0.0873 6.3984 14.7712 15.2470 19.8481 5.4419 37.1099 16.5730 7.0019 7.8422 71.3440 69.1506 69.4279 3.8178 4.0806 0.0702 13.2314 1.5377 2.1828 8.9729 30.7421 0.1968 0.4399 14.8333 0.0179 1.3346 58.1193 19.2460 26.4616 32.0187 0.8396 6.4551 2.2010 16.1845 21.5660 5.9689 0.0032 0.1803 4.1684 135.5131 7.3719 47.9867 33.5820 0.9181 20.9060 4.0276 8.8276 3.6182 2.0840 37.1729 10.1507 7.4153 57.4479 40.2580 72.6694 36.1503 6.9178 157.8716 4.2302 1.4616 66.0972 33.7953 2.6828 0.1190 3.5606 4.5816 2.8556 13.7483 0.4242 15.4277 22.6177 20.1719 4.6104 2.7039 1.9007
temp: 298.150 k
press: 1.00000 atm
elementType: 16 8 7 7 6 6 6 6 6 6 6 6 6 6 6 6 6 6 6 6 6 1 1 1 1 1 1 1 1 1 1 1 1 1 1
symmnumber: 1
zpe: 697456.0 jmol-1
zpe.correction: 0.265647 hartree
zpe.thermalcorrener: 0.283943 hartree
zpe.thermalcorrenthalpy: 0.284887 hartree
zpe.thermalcorrgfe: 0.213294 hartree
zpe.sumelectzpe: -1237.505444 hartree
zpe.sumelectthermal: -1237.487148 hartree
zpe.sumelectthermalent: -1237.486204 hartree
zpe.sumelectthermalfe: -1237.557796 hartree
dipole: 9.7575 1.1410 0.6199
dipole: 9.8435
quadrupole: -143.6507 -128.8450 -123.8612
quadrupole: -7.5922 -9.7092 -3.8617
quadrupole: -11.5318 3.2739 8.2578 -7.5922 -9.7092 -3.8617
hfenergy: -1237.7710905 hartree
pointgroup: C01 [X(C17H14N2O1S1)]
dipole: 3.8602096 -0.1925074 -0.2445426 debye
polarizability: 308.3802345|12.6645643|190.0929216|15.8093671|16.7158509|159.6919326 unknown
InChI: InChI=1S/C17H14N2OS/c20-16(12-19-11-10-18-13-19)15-8-4-5-9-17(15)21-14-6-2-1-3-7-14/h1-11,13H,12H2
charge 0 multiplicity 1
35 atoms
S  0.831047 0.854728 0.172834
O  -2.863452 -1.501279 -1.204989
N  -3.599656 0.771889 0.216371
N  -5.58781 1.117166 1.257095
C  -2.182724 0.466154 0.045224
C  -0.569628 -1.575629 -0.482371
C  -1.922335 -0.914998 -0.600668
C  0.684999 -0.972824 -0.137711
C  -0.584528 -2.978673 -0.751986
C  1.850074 -1.775743 -0.059117
C  -4.530985 1.066515 -0.788826
C  0.571172 -3.769531 -0.669516
C  -4.289822 0.810019 1.43193
C  1.797371 -3.159614 -0.315404
C  2.653461 1.118987 0.311175
C  -5.7440 1.278986 -0.131823
C  3.421499 1.336283 -0.856224
C  3.245162 1.196724 1.592716
C  4.800741 1.624021 -0.736221
C  4.624808 1.48943 1.7048
C  5.402215 1.701442 0.542364
H  -1.701647 1.239664 -0.58675
H  -1.688495 0.522857 1.032011
H  -1.550317 -3.413981 -1.028533
H  2.807738 -1.315922 0.200482
H  -4.263668 1.062408 -1.841286
H  0.520929 -4.843555 -0.873942
H  -3.804325 0.619943 2.38689
H  2.713848 -3.755064 -0.23928
H  -6.710463 1.528068 -0.56326
H  2.945543 1.281947 -1.84043
H  2.634409 1.032283 2.485994
H  5.399057 1.793277 -1.637806
H  5.086313 1.55337 2.695948
H  6.469669 1.930653 0.632008
