program: Orca
programVersion: 6.0.x
elementType: C C C C C C H H C H C C C C H C H C H H H C O H H O H
charge: 1
multiplicity: 1
keywords: wB97X-D3 def2-TZVPPD autoaux TightSCF
formula: C14H11O2
InChI: InChI=1/C14H11O2/c15-11-7-6-10(8-12(11)16)14-13(17-14)9-4-2-1-3-5-9/h1-8,15-16H
27 atoms
C  0.428084 -3.986592 0.037086
C  1.585983 -3.244201 -0.18911
C  1.515506 -1.864964 -0.290727
C  0.276305 -1.22348 -0.15921
C  -0.904488 -1.96351 0.061877
C  -0.821599 -3.336147 0.163441
H  2.417693 -1.288148 -0.461742
H  -1.860679 -1.459266 0.160511
C  0.202825 0.200702 -0.248311
H  0.314944 0.807863 -1.338304
C  -0.021136 2.8546 -0.08427
C  -1.236515 3.498692 -0.376597
C  1.107241 3.585534 0.329801
C  -1.316822 4.876537 -0.246445
H  -2.098456 2.920839 -0.693044
C  1.008356 4.963253 0.452095
H  2.036537 3.07324 0.554703
C  -0.198305 5.603811 0.165559
H  -2.248753 5.385738 -0.463785
H  1.86888 5.539048 0.773252
H  -0.269486 6.681599 0.267108
C  0.067036 1.43643 -0.178415
O  0.51091 -5.31251 0.13485
H  2.530246 -3.767744 -0.279693
H  -0.364094 -5.693927 0.293276
O  -1.862011 -4.177137 0.38312
H  -2.702583 -3.7183 0.472428
totalener: -690.27092979874612 hartree
nucrepener: 915.61110223149524 hartree
electener: -1605.88204688928090 hartree
oneelecener: -2735.52888572048641 hartree
twoeener: 1129.64683883120551 hartree
kineticenergy: 686.98786881875174 hartree
xcener: -66.928670151246 hartree
energy: -527.9558 -527.6369 -286.6871 -286.4577 -285.3431 -285.2678 -284.8644 -284.6087 -284.1780 -284.1725 -284.0260 -283.9078 -283.8516 -283.6604 -283.6527 -283.3667 -36.2836 -35.4465 -31.9612 -30.8241 -30.2702 -28.2251 -27.6263 -27.5454 -27.3563 -24.6701 -24.3318 -24.0130 -23.5871 -22.0190 -21.7304 -21.6206 -20.5621 -20.2340 -19.9482 -19.8130 -19.3628 -18.4863 -18.4697 -18.4410 -18.2219 -17.8451 -17.2934 -17.0933 -16.7020 -16.5617 -16.2817 -16.1964 -15.8853 -15.7430 -15.3969 -13.6042 -13.3192 -12.8570 -11.8518 -4.2967 -2.7873 -2.2128 -2.1120 -1.8787 -1.5825 -1.2291 -0.8396 -0.7452 -0.4620 -0.3114 electronvolt
chargesum: 1.0000000
charge: 0.532906 -0.298764 -0.552587 0.329965 -0.851734 1.223894 0.108299 -0.028312 0.556048 0.247777 0.362996 -0.479199 -0.421014 -0.132833 0.113387 -0.146493 0.111402 -0.122690 0.163831 0.167641 0.162687 0.409925 -0.458635 0.146955 0.183736 -0.435651 0.106463
charge: -0.176471 0.113332 0.074434 -0.182982 0.127089 -0.179892 0.028588 0.035950 0.143004 0.121848 -0.179597 0.078983 0.082699 0.052887 0.027890 0.053801 0.029145 0.067484 0.019853 0.020280 0.022690 0.173654 0.350657 0.035320 -0.128218 0.313929 -0.126356
qa: 0.5329 -0.2988 -0.5526 0.3300 -0.8517 1.2239 0.1083 -0.0283 0.5560 0.2478 0.3630 -0.4792 -0.4210 -0.1328 0.1134 -0.1465 0.1114 -0.1227 0.1638 0.1676 0.1627 0.4099 -0.4586 0.1470 0.1837 -0.4357 0.1065
va: 3.2745 3.3248 3.2309 1.1594 3.1331 1.7942 0.9891 1.0416 2.1539 0.9141 1.2145 3.2264 3.2512 3.3122 0.9972 3.3319 0.9980 3.3219 0.9226 0.9173 0.9284 2.4180 1.7893 0.9583 0.9982 1.7777 1.0473
dispcorr: -0.008456402 hartree
energy: -690.279386201170
