program: Gaussian 09
title: 000052733
version: EM64L-G09RevD.01
frameworkgroup: C1[X(C7H9NOS)]
method: RPBEPBE
basis: SDD
operation: Freq
keyword: #p
keyword: freq=noraman
keyword: PBEPBE/SDD
title: #p freq=noraman PBEPBE/SDD
converged: YES YES NO NO
title: Mulliken charges:
elementType: S O N C C C C C C C H H H H H H H H H
charge: 0.243077 -0.419624 -0.022175 -0.439920 -0.316705 -0.087304 -0.207939 -0.267527 -0.125831 -0.509748 0.171481 0.225021 0.240104 0.191944 0.198432 0.282720 0.247036 0.266813 0.330146
chargesum: 0.00000
title: Mulliken charges with hydrogens summed into heavy atoms:
elementType: S O N C C C C C C C
charge: 0.243077 -0.089478 -0.022175 -0.043418 0.115344 -0.087304 -0.009507 0.015193 0.121204 -0.242936
polarizability: 1.69801198e+02 5.18549996e+00 9.84217691e+01 -1.70351511e+01 8.12340643e+00 5.81138413e+01
1716.lowfreq: -7.1453 -0.0015 -0.0009 0.0020 6.7837 10.6885 30.8966 57.2676 106.2412
frequency: 30.6788 57.2109 106.2354 116.8401 171.1963 277.3674 302.9001 315.9322 334.5453 388.0899 465.2229 523.7398 577.4872 578.4713 693.7188 703.2469 772.7781 825.6927 843.6112 848.5482 887.7886 923.2250 956.6833 1011.0182 1017.5675 1042.0185 1046.1080 1083.8460 1151.3128 1166.3771 1233.8062 1242.3081 1321.2218 1335.7286 1347.3473 1372.0345 1378.4649 1454.6501 1458.3268 1461.9110 1543.9348 1610.5316 2871.2157 2928.3738 2962.5597 3019.0842 3099.6752 3176.6166 3198.5209 3239.2632 3552.5492
redmass: 5.8859 6.2322 3.1828 4.3537 2.5467 2.1810 2.1533 2.4772 5.2283 2.6811 4.0299 2.8661 8.5216 3.1968 7.0049 1.1683 4.3343 4.6016 2.2442 1.4545 2.2274 1.3911 1.7230 2.0926 1.9888 2.4698 1.9026 1.1819 2.1603 1.2823 1.3332 1.2321 1.2919 1.2843 2.3234 1.2073 1.5010 1.0854 2.0874 1.7001 6.1371 7.0101 1.0690 1.0854 1.0693 1.0892 1.0950 1.0899 1.0978 1.0999 1.0661
irintensity: 1.1126 5.1506 7.3494 5.5549 14.5312 38.6736 104.2989 56.4249 5.1827 9.4179 26.7170 17.5781 3.5268 1.0266 1.6001 105.4066 21.7923 9.0264 5.5570 23.9248 25.7277 2.8178 7.8835 27.2729 48.6530 24.2506 0.8780 4.3866 9.6270 16.1075 40.3903 5.9465 8.6708 16.6290 4.7553 14.3415 14.7207 18.6104 34.6641 1.8143 8.8255 93.5075 118.9066 68.2854 110.0262 52.6966 18.1167 6.5405 0.9587 0.4967 3.9819
temp: 298.150 k
press: 1.00000 atm
elementType: 16 8 7 6 6 6 6 6 6 6 1 1 1 1 1 1 1 1 1
symmnumber: 1
zpe: 382970.0 jmol-1
zpe.correction: 0.145866 hartree
zpe.thermalcorrener: 0.156160 hartree
zpe.thermalcorrenthalpy: 0.157104 hartree
zpe.thermalcorrgfe: 0.108511 hartree
zpe.sumelectzpe: -799.375610 hartree
zpe.sumelectthermal: -799.365315 hartree
zpe.sumelectthermalent: -799.364371 hartree
zpe.sumelectthermalfe: -799.412964 hartree
dipole: 0.3318 -0.7721 -1.7368
dipole: 1.9294
quadrupole: -51.4396 -61.9781 -72.9995
quadrupole: -3.9551 -9.4404 3.3253
quadrupole: 10.6994 0.1610 -10.8604 -3.9551 -9.4404 3.3253
hfenergy: -799.5214751 hartree
pointgroup: C01 [X(C7H9N1O1S1)]
dipole: -0.0982998 0.7493235 -0.0712411 debye
dipolederiv: 0.0868757 0.0567232 0.0340758 0.0032337 -0.0765496 -0.2388533 -0.0176082 -0.2147405 -0.1133073 -0.6266685 -0.1167389 0.0237399 -0.2611753 -0.1729012 0.137826 0.2305144 0.1932097 -0.7323563 -0.7221908 0.1116204 -0.0788518 -0.1535598 -0.3584082 0.0013961 -0.3112029 0.048976 -0.4611662 0.2470814 -0.1789657 0.0907564 -0.421779 0.2492588 0.1151739 0.1192979 0.1076341 0.187877 0.4143087 0.0361162 -0.0139097 0.3512185 0.2327634 -0.0538889 -0.1420189 -0.1169294 0.6517535 -0.3132194 0.1807196 0.1517727 0.4192952 -0.1022816 0.2479578 0.4078881 0.1598212 0.1536392 0.9879476 -0.2190886 0.1496409 -0.333701 0.2565424 0.1070248 -0.0248269 0.1695985 0.2696005 0.1121041 0.0239965 0.1170711 -0.1152252 -0.1350958 -0.0614576 -0.0315788 -0.0150188 -0.1406297 -0.1740776 -0.0991813 -0.1151919 -0.1436363 -0.0899167 0.0056796 -0.1720646 0.0126351 -0.1857143 -0.2400765 -0.1461567 -0.1006133 0.0390398 -0.0246603 0.3370423 0.0863122 0.2761863 0.0170259 -0.1206008 0.0075539 -0.0126909 0.1695668 -0.1665192 -0.0926576 0.117714 -0.1994435 -0.0337304 -0.0585478 0.0326326 -0.057925 0.1083648 0.0627252 0.0448604 -0.1069527 0.0787271 -0.1130466 0.1443229 0.0413234 0.0274029 -0.0042052 -0.0651578 -0.0713129 -0.0192984 -0.053206 -0.0027705 -0.3155282 0.0600899 -0.0838201 0.044859 0.0438461 0.0575096 -0.0007639 0.0338137 -0.0214012 0.0069283 0.0626989 0.0014474 0.0682369 -0.0232162 -0.170797 0.0131924 -0.1743915 -0.0360895 0.1030993 -0.0149408 -0.0570353 -0.0279026 0.1313612 -0.0789877 -0.0709725 -0.0740883 0.0827509 0.04934 0.0717884 0.0231294 0.1027739 0.0701709 -0.0975594 0.0542077 -0.1083185 0.0945 0.0137183 0.0309857 -0.0528154 0.043923 0.1549406 -0.057356 -0.0410773 -0.0620594 0.1334056 0.4051834 0.0588232 -0.046183 0.1106726 0.0130982 -0.1316004 -0.0907615 -0.0624054 0.2496595 unknown
polarizability: 167.1868755|-17.0054989|75.6219745|17.7418686|20.0958329|83.527958 unknown
InChI: InChI=1S/C7H9NOS/c9-4-3-8-6-7-2-1-5-10-7/h1-2,5-6,9H,3-4H2
charge 0 multiplicity 1
19 atoms
S  2.218499 0.788148 1.29062
O  -3.337047 -0.468594 1.364666
N  -1.258716 0.315744 -0.755415
C  -2.61995 0.857592 -0.644187
C  -3.582353 -0.20237 -0.057354
C  0.999291 0.181225 0.09068
C  -0.359929 0.710976 0.109508
C  1.569461 -0.776418 -0.747854
C  2.952544 -1.042733 -0.466841
C  3.458371 -0.29437 0.589619
H  -2.684578 1.785017 -0.020689
H  -2.972283 1.107064 -1.664319
H  -3.417172 -1.169141 -0.558355
H  -4.631285 0.121844 -0.229169
H  -0.582821 1.468474 0.893873
H  0.98666 -1.259555 -1.534658
H  3.556152 -1.763629 -1.02339
H  4.460561 -0.295276 1.01428
H  -3.494905 0.363303 1.879883
