program: Gaussian 09
title: 000052767
version: EM64L-G09RevD.01
frameworkgroup: C1[X(C16H20N2OS)]
method: RPBEPBE
basis: SDD
operation: Freq
keyword: #p
keyword: freq=noraman
keyword: PBEPBE/SDD
title: #p freq=noraman PBEPBE/SDD
converged: YES YES NO NO
title: Mulliken charges:
elementType: S O N N C C C C C C C C C C C C C C C C H H H H H H H H H H H H H H H H H H H H
charge: 0.228358 -0.196217 -0.103599 -0.097526 -0.037200 -0.371656 -0.717943 -0.708645 -0.706860 -0.192059 0.304883 -0.488973 -0.166789 -0.240340 0.112414 -0.357188 -0.341119 -0.159549 -0.213307 -0.322936 0.211993 0.220271 0.221337 0.279539 0.278430 0.219341 0.205171 0.217942 0.204011 0.219267 0.218225 0.254934 0.244815 0.247456 0.249650 0.239233 0.281119 0.261283 0.252753 0.249481
chargesum: 0.00000
title: Mulliken charges with hydrogens summed into heavy atoms:
elementType: S O N N C C C C C C C C C C C C C C C C
charge: 0.228358 -0.196217 -0.103599 -0.097526 0.174793 0.069952 -0.159973 -0.066192 -0.065357 -0.192059 0.304883 0.010776 0.080667 0.009310 0.112414 -0.117955 -0.060000 0.101734 0.039446 -0.073455
polarizability: 3.59461305e+02 -2.19585626e+00 1.77638975e+02 -7.34364388e-01 5.63318559e+00 1.33289930e+02
1716.lowfreq: -10.4915 -3.0127 -0.0022 -0.0021 -0.0020 3.6635 10.1964 18.1380 20.3762
frequency: 9.8621 17.5160 20.2661 28.3815 37.4135 63.7940 73.0311 79.0049 92.1255 130.0144 135.1734 172.7018 212.7960 220.5078 242.5994 244.9621 258.9110 291.0597 326.9788 352.1566 357.5536 364.9689 403.3858 407.8366 459.1658 507.9318 521.4191 565.2526 613.0644 625.5337 651.1263 666.7460 714.2288 720.2731 725.3235 744.0874 764.0519 777.5682 788.2737 803.2317 817.2282 841.0616 850.2270 878.9720 909.0594 940.9244 942.1094 953.8414 967.2369 969.2389 970.6123 999.0417 1003.2444 1004.7032 1014.8784 1055.9869 1075.6783 1086.2268 1108.1549 1123.8208 1127.7977 1171.1307 1191.6140 1196.7410 1200.0497 1225.0338 1239.1290 1247.2464 1270.3591 1290.1079 1303.3363 1313.0068 1319.0856 1337.1499 1348.1206 1358.5008 1361.3683 1365.3410 1379.3414 1397.1170 1419.3418 1435.7319 1452.6344 1462.4157 1465.3812 1468.4426 1476.8391 1480.4297 1484.9425 1486.7026 1489.5630 1549.6112 1592.6141 1613.0973 2966.9552 2970.1658 2973.6066 2985.0560 2986.1575 3017.2077 3036.7776 3048.6651 3061.0922 3068.9820 3070.3191 3074.4538 3098.4473 3138.0598 3139.1062 3162.6192 3168.3956 3225.5034 3226.8715 3256.2085
redmass: 4.1391 4.8550 3.5560 4.0040 4.5140 4.3124 4.6559 3.7879 5.0607 2.0835 4.6264 5.4891 1.3430 1.8514 1.2706 6.2436 5.4268 4.8761 2.5500 5.4393 2.0704 2.2381 2.8894 6.9371 3.4196 3.1724 5.2225 2.6612 3.1147 7.0852 3.3919 5.8305 5.0307 1.3055 3.8023 5.1405 1.4470 1.1708 3.1483 5.2061 1.3984 1.4435 1.3305 6.3011 1.2017 1.5234 1.4019 2.1651 1.9245 1.7804 3.5660 1.3865 2.6054 2.4367 3.1978 1.7300 3.5780 1.3613 1.8185 1.6151 1.5781 1.4596 1.9537 1.4231 1.2088 1.5707 2.3062 1.2886 1.9073 1.1398 1.3976 1.4155 1.5984 1.4442 4.2209 3.2977 1.4375 3.1842 1.2132 1.2219 4.1351 1.6905 1.1116 1.8234 1.0459 1.0881 1.0536 2.9233 1.0595 2.3667 1.0535 6.6123 7.1074 7.4564 1.0767 1.0355 1.0369 1.0618 1.0661 1.0553 1.1026 1.0984 1.0997 1.0985 1.1000 1.0990 1.1091 1.0882 1.0884 1.0958 1.0950 1.0950 1.0938 1.1096
irintensity: 1.9221 0.1989 1.7779 2.4025 0.3141 2.2441 2.0872 0.1734 1.8325 1.3063 1.7462 0.1645 0.7208 1.2883 0.5213 0.0415 0.6149 4.9229 0.7711 4.5038 0.0329 0.1165 0.0152 4.4022 8.7889 18.0655 14.8398 14.3193 8.3205 0.7658 11.7847 15.4516 22.9491 21.2902 1.0396 22.9111 68.0235 14.8635 1.0410 6.1042 28.4715 4.0467 25.2098 13.4988 1.2925 0.7737 1.7213 2.8354 14.1996 6.9905 48.4739 0.7617 6.4797 12.9850 49.1176 29.5661 137.4021 0.2514 14.8386 11.4257 4.5217 3.4196 9.5810 3.6960 97.8674 44.9919 223.3152 2.4615 16.8525 0.3185 20.0704 18.7648 21.5751 2.6953 3.3363 21.0764 1.7487 2.1887 22.2292 16.3128 23.7725 27.6885 36.5702 35.3804 1.5934 1.6798 3.3196 16.4683 19.5609 6.7214 18.2194 112.8980 403.2629 30.7385 11.7701 36.6669 19.1929 57.2528 30.2601 14.0311 13.1823 4.9587 17.9718 101.3517 18.6669 81.6913 22.5704 14.4636 0.4989 7.5454 7.1428 5.9385 1.0067 2.3451
temp: 298.150 k
press: 1.00000 atm
elementType: 16 8 7 7 6 6 6 6 6 6 6 6 6 6 6 6 6 6 6 6 1 1 1 1 1 1 1 1 1 1 1 1 1 1 1 1 1 1 1 1
symmnumber: 1
zpe: 854710.9 jmol-1
zpe.correction: 0.325542 hartree
zpe.thermalcorrener: 0.346279 hartree
zpe.thermalcorrenthalpy: 0.347223 hartree
zpe.thermalcorrgfe: 0.270491 hartree
zpe.sumelectzpe: -1202.988970 hartree
zpe.sumelectthermal: -1202.968233 hartree
zpe.sumelectthermalent: -1202.967289 hartree
zpe.sumelectthermalfe: -1203.044021 hartree
dipole: 9.4171 -2.2295 1.6320
dipole: 9.8140
quadrupole: -165.0223 -128.5503 -127.5258
quadrupole: -8.2699 -12.1229 -0.0163
quadrupole: -24.6562 11.8158 12.8403 -8.2699 -12.1229 -0.0163
hfenergy: -1203.3145123 hartree
pointgroup: C01 [X(C16H20N2O1S1)]
dipole: 3.6913918 -0.8156063 0.7853589 debye
polarizability: 359.240427|-6.5912156|178.2596666|-1.6750556|-3.6022382|132.8901162 unknown
InChI: InChI=1S/C16H20N2OS/c1-13(2)7-10-20-15-5-3-14(4-6-15)16(19)11-18-9-8-17-12-18/h3-6,8-9,12-13H,7,10-11H2,1-2H3
charge 0 multiplicity 1
40 atoms
S  3.584977 1.645739 -0.518015
O  -3.273935 1.757479 -0.432945
N  -4.537632 -0.658239 0.217972
N  -6.638393 -1.216765 -0.438178
C  6.743713 -1.107917 0.165744
C  5.924632 0.181074 -0.144437
C  4.398058 -0.008826 -0.071918
C  6.512386 -1.623272 1.607321
C  6.500596 -2.228538 -0.874338
C  1.804789 1.28966 -0.389665
C  -1.020529 0.919523 -0.238687
C  -3.081474 -0.593771 0.23144
C  1.267168 0.031631 -0.015278
C  0.919292 2.364271 -0.689665
C  -2.505832 0.788791 -0.177292
C  -0.127937 -0.146536 0.058296
C  -0.467519 2.178673 -0.613839
C  -5.416909 -0.004451 1.092187
C  -5.325882 -1.370018 -0.690616
C  -6.700732 -0.362144 0.677308
H  7.809656 -0.807631 0.087037
H  6.196323 0.53884 -1.157373
H  6.223435 0.973984 0.569449
H  4.047533 -0.762974 -0.796168
H  4.070874 -0.28315 0.944807
H  7.209948 -2.447592 1.843574
H  5.485645 -2.014177 1.739202
H  6.670384 -0.820975 2.352208
H  5.472031 -2.63092 -0.807897
H  7.193724 -3.073079 -0.705747
H  6.65745 -1.8623 -1.906164
H  -2.699337 -0.849484 1.239554
H  -2.693769 -1.363818 -0.461069
H  1.923607 -0.810335 0.220671
H  1.325676 3.339112 -0.98096
H  -0.507977 -1.130913 0.352853
H  -1.157094 2.997894 -0.84267
H  -5.06506 0.655139 1.880374
H  -4.899066 -1.970598 -1.491326
H  -7.655419 -0.058285 1.099849
