program: Orca
programVersion: 6.0.x
elementType: C C C C C C H H H H C H C C C C H C H C H H H C O C H H H
charge: 1
multiplicity: 1
keywords: wB97X-D3 def2-TZVPPD autoaux TightSCF
formula: C15H13O
InChI: InChI=1/C15H13O/c1-16-15-11-9-14(10-12-15)8-7-13-5-3-2-4-6-13/h2-7,9-12H,1H3
29 atoms
C  -0.00488 -3.566598 0.227167
C  0.670773 -2.844199 1.252843
C  0.966948 -1.529722 1.069724
C  0.600457 -0.863424 -0.15651
C  -0.080857 -1.616167 -1.176016
C  -0.378235 -2.936206 -0.992441
H  0.931361 -3.372678 2.162364
H  1.480435 -0.963187 1.839164
H  -0.354076 -1.113804 -2.098116
H  -0.8902 -3.490616 -1.768452
C  0.884515 0.439479 -0.349036
H  2.149635 1.867757 -0.997898
C  0.360712 2.871554 -0.194145
C  -0.914045 2.746235 0.373919
C  0.890489 4.141075 -0.445257
C  -1.64551 3.883052 0.687572
H  -1.335079 1.7635 0.56867
C  0.152482 5.277232 -0.127491
H  1.877114 4.242761 -0.887585
C  -1.112739 5.149271 0.438622
H  -2.631581 3.784724 1.128508
H  0.568097 6.259985 -0.321052
H  -1.686774 6.035759 0.686588
C  1.175328 1.691148 -0.534618
O  -0.243252 -4.822485 0.501124
C  -0.925567 -5.676228 -0.433628
H  -0.350007 -5.76057 -1.358238
H  -0.983875 -6.643484 0.058781
H  -1.93029 -5.293425 -0.626775
totalener: -654.37562465762494 hartree
nucrepener: 917.79820918792632 hartree
electener: -1572.17386276408706 hartree
oneelecener: -2688.94119715909710 hartree
twoeener: 1116.76733439501004 hartree
kineticenergy: 651.12457248983208 hartree
xcener: -64.976455470204 hartree
energy: -529.1449 -286.9100 -285.5046 -285.0671 -284.9665 -284.9409 -284.8580 -284.6040 -284.3588 -284.1852 -283.6530 -283.0461 -283.0116 -282.7789 -282.7639 -282.7196 -37.3442 -31.4555 -30.1627 -29.3369 -28.5176 -28.2095 -26.9925 -26.6129 -26.1315 -24.5630 -24.0902 -22.9545 -22.6000 -22.1969 -21.5581 -20.7959 -20.4731 -20.0760 -19.8273 -19.3220 -18.9529 -18.7249 -18.3640 -18.0428 -17.8682 -17.6188 -17.4056 -17.1847 -17.0525 -16.4958 -16.2971 -15.8714 -15.1867 -14.9451 -14.7407 -14.2116 -13.4475 -12.3489 -12.0232 -5.3384 -2.7720 -2.6228 -1.5410 -1.4104 -1.3169 -0.9333 -0.7621 -0.4789 -0.4054 -0.2558 electronvolt
chargesum: 1.0000000
charge: 1.155996 -0.307518 -0.386415 -0.234503 -0.474446 0.029350 0.142022 0.131488 0.137277 0.106701 1.182563 0.101172 0.924643 -0.280427 -0.423493 -0.276723 0.087586 -0.175901 0.038024 -0.200646 0.150319 0.157785 0.151657 -0.458608 -0.418465 -0.486341 0.244554 0.140384 0.241964
charge: -0.185230 0.124368 0.120656 -0.174816 0.126669 0.113591 0.037969 0.040144 0.041569 0.018471 0.160889 0.049698 -0.175824 0.054839 0.054780 0.035282 0.016968 0.038669 0.018815 0.039707 0.013576 0.014868 0.014947 0.090234 0.041467 0.195796 0.023577 0.024780 0.023543
qa: 1.1560 -0.3075 -0.3864 -0.2345 -0.4744 0.0294 0.1420 0.1315 0.1373 0.1067 1.1826 0.1012 0.9246 -0.2804 -0.4235 -0.2767 0.0876 -0.1759 0.0380 -0.2006 0.1503 0.1578 0.1517 -0.4586 -0.4185 -0.4863 0.2446 0.1404 0.2420
va: 2.3333 3.3722 2.9264 1.0097 3.1276 2.9841 0.9832 0.9980 0.9879 0.9294 -0.5547 0.9886 0.8891 3.3188 3.1520 3.3726 0.9017 3.3555 1.0033 3.3735 0.9273 0.9263 0.9298 1.4143 1.7347 3.8066 0.9337 1.0596 0.9372
dispcorr: -0.009261043 hartree
energy: -654.384885701066
