program: Orca
programVersion: 6.0.x
elementType: C C C C C C H H H H C H C C C C H C H C H H H C C H H H
charge: 1
multiplicity: 1
keywords: wB97X-D3 def2-TZVPPD autoaux TightSCF
formula: C15H13
InChI: InChI=1/C15H13/c1-13-7-9-15(10-8-13)12-11-14-5-3-2-4-6-14/h2-11H,1H3
28 atoms
C  -0.246536 -4.022912 0.12291
C  0.280864 -3.329535 1.235869
C  0.653113 -2.013803 1.127457
C  0.503735 -1.33255 -0.1253
C  -0.03267 -2.041673 -1.250217
C  -0.397791 -3.356822 -1.114662
H  0.389778 -3.848413 2.182307
H  1.059319 -1.473113 1.975772
H  -0.144432 -1.522227 -2.196121
H  -0.807547 -3.896602 -1.961766
C  0.859613 -0.029384 -0.239603
H  2.263572 1.351178 -0.633643
C  0.407433 2.420565 -0.112047
C  -0.948791 2.339258 0.231609
C  1.022249 3.669483 -0.244559
C  -1.677423 3.501336 0.440558
H  -1.434221 1.372442 0.334408
C  0.285507 4.830516 -0.032551
H  2.073208 3.736056 -0.509798
C  -1.061544 4.74731 0.308826
H  -2.727621 3.438419 0.704021
H  0.764424 5.797873 -0.136008
H  -1.634222 5.653782 0.47295
C  1.218527 1.211698 -0.34132
C  -0.614014 -5.465079 0.245185
H  -1.417561 -5.737618 -0.441798
H  0.26057 -6.075583 -0.014665
H  -0.902943 -5.723789 1.265596
totalener: -579.14534829880085 hartree
nucrepener: 814.83729558086225 hartree
electener: -1393.98266446765001 hartree
oneelecener: -2381.01878792359867 hartree
twoeener: 987.03612345594865 hartree
kineticenergy: 576.15779546878684 hartree
xcener: -58.875302814355 hartree
energy: -285.9606 -285.4145 -285.1578 -285.0130 -285.0113 -284.8992 -284.2591 -284.2582 -283.8731 -283.4399 -283.2321 -283.1970 -282.9404 -282.9248 -282.8779 -31.6643 -30.4261 -29.6898 -28.6300 -28.3573 -27.0378 -26.7786 -26.1573 -24.2325 -24.1580 -23.0950 -22.7702 -22.2106 -20.7417 -20.3000 -20.1531 -19.8804 -18.9655 -18.8998 -18.7067 -18.4369 -17.9003 -17.7302 -17.3630 -17.3446 -17.0592 -16.7439 -16.7319 -16.3256 -15.3663 -15.1174 -14.9793 -14.1336 -14.0961 -12.5150 -12.2266 -5.7467 -2.9872 -2.7067 -1.8042 -1.4763 -1.4682 -0.9229 -0.7040 -0.4970 -0.3516 -0.2617 electronvolt
chargesum: 1.0000000
charge: 0.776006 -0.161884 -0.332385 -0.119318 -0.326739 -0.155669 0.100026 0.151128 0.150122 0.099612 1.202717 0.106106 0.935701 -0.267073 -0.436019 -0.292206 0.079574 -0.190568 0.044508 -0.179897 0.149098 0.149807 0.159974 -0.393274 -0.915967 0.211945 0.244376 0.210302
charge: -0.113164 0.087638 0.126813 -0.171692 0.126489 0.087415 0.030705 0.039081 0.038923 0.030865 0.180720 0.054728 -0.174583 0.056585 0.056559 0.037779 0.017975 0.041069 0.019642 0.043132 0.014658 0.015769 0.015977 0.096765 0.196298 0.008870 0.026567 0.008418
qa: 0.7760 -0.1619 -0.3324 -0.1193 -0.3267 -0.1557 0.1000 0.1511 0.1501 0.0996 1.2027 0.1061 0.9357 -0.2671 -0.4360 -0.2922 0.0796 -0.1906 0.0445 -0.1799 0.1491 0.1498 0.1600 -0.3933 -0.9160 0.2119 0.2444 0.2103
va: 1.8436 3.1814 3.1881 1.0351 3.1701 3.1830 0.9584 0.9838 0.9871 0.9591 -0.4247 0.9880 0.8424 3.2999 3.1589 3.4003 0.9091 3.4025 0.9950 3.3680 0.9311 0.9314 0.9253 1.4472 3.5147 1.0174 0.9959 1.0189
dispcorr: -0.008717064 hartree
energy: -579.154065362762
