program: Orca
programVersion: 6.0.x
elementType: C C C C C C H H H C H C C C C H C H C H H H C O C H H H O C H H H
charge: 1
multiplicity: 1
keywords: wB97X-D3 def2-TZVPPD autoaux TightSCF
formula: C16H15O2
InChI: InChI=1/C16H15O2/c1-17-15-11-10-14(12-16(15)18-2)9-8-13-6-4-3-5-7-13/h3-8,10-12H,1-2H3
33 atoms
C  0.003884 -3.136221 -0.481111
C  -0.069647 -2.522124 0.826441
C  0.253266 -1.200358 0.955466
C  0.656201 -0.433421 -0.198592
C  0.713693 -1.065663 -1.484248
C  0.39346 -2.388736 -1.6183
H  0.214629 -0.700976 1.915472
H  1.015823 -0.478813 -2.344863
H  0.439807 -2.863758 -2.589556
C  0.984997 0.86796 -0.089631
H  2.378185 2.297691 0.209823
C  0.440904 3.299702 -0.093353
C  -0.934766 3.175288 -0.327879
C  1.011005 4.568826 0.045105
C  -1.726324 4.311626 -0.42064
H  -1.386563 2.19298 -0.437411
C  0.212393 5.704728 -0.049145
H  2.077019 4.670735 0.225912
C  -1.154137 5.577273 -0.281099
H  -2.791272 4.212763 -0.601079
H  0.659508 6.686736 0.059805
H  -1.776118 6.463102 -0.353323
C  1.317518 2.119032 0.015884
O  -0.313996 -4.398943 -0.507005
C  -0.287692 -5.148848 -1.732123
H  -1.009816 -4.737372 -2.441397
H  0.720634 -5.151603 -2.152529
H  -0.576209 -6.158271 -1.45001
O  -0.4573 -3.348236 1.798185
C  -0.570217 -2.828236 3.119251
H  0.398478 -2.463945 3.477959
H  -1.31648 -2.02749 3.156428
H  -0.897633 -3.66314 3.734908
totalener: -768.91322529785680 hartree
nucrepener: 1155.48120514861512 hartree
electener: -1924.39446133784099 hartree
oneelecener: -3317.56629631639589 hartree
twoeener: 1393.17183497855490 hartree
kineticenergy: 765.17327586095394 hartree
xcener: -75.252762499737 hartree
energy: -529.0428 -527.9778 -286.7777 -285.7191 -285.2829 -284.8772 -284.8730 -284.7990 -284.4317 -284.3174 -284.3164 -284.2212 -283.5391 -282.9430 -282.9118 -282.6922 -282.6759 -282.6360 -37.3765 -36.1265 -31.2158 -30.0256 -29.1906 -28.2788 -28.0818 -26.9128 -26.5188 -26.1276 -25.9266 -24.3353 -23.5617 -22.7961 -22.4768 -21.9881 -21.4265 -21.0322 -20.4631 -20.1250 -20.0059 -19.6046 -19.1823 -19.1158 -18.7776 -18.5887 -18.1601 -17.6943 -17.6445 -17.5110 -17.2964 -17.0901 -17.0417 -16.3985 -16.1849 -15.8287 -15.5520 -15.4507 -15.0905 -14.8518 -14.6114 -13.7041 -12.4678 -12.2594 -11.9118 -5.2061 -2.6315 -2.1448 -1.4040 -1.2401 -1.2155 -0.9119 -0.8146 -0.5353 -0.3884 -0.2182 electronvolt
chargesum: 1.0000000
charge: 1.164399 1.039373 -0.419320 -0.610123 -0.593988 -0.163755 0.053033 0.134633 0.077785 1.183448 0.099333 0.919730 -0.269099 -0.441565 -0.303080 0.100435 -0.181959 0.042873 -0.170762 0.145028 0.146244 0.152547 -0.471625 -0.371405 -0.592038 0.273035 0.271361 0.132771 -0.423225 -0.559276 0.253862 0.256560 0.124772
charge: -0.123484 -0.175464 0.153264 -0.175139 0.124799 0.116917 0.028458 0.041134 0.019069 0.158798 0.047530 -0.176250 0.054167 0.053440 0.033776 0.016787 0.037182 0.018244 0.037635 0.012924 0.014308 0.014247 0.087249 0.061477 0.202949 0.025629 0.024724 0.026543 0.007695 0.164442 0.021844 0.022004 0.023102
qa: 1.1644 1.0394 -0.4193 -0.6101 -0.5940 -0.1638 0.0530 0.1346 0.0778 1.1834 0.0993 0.9197 -0.2691 -0.4416 -0.3031 0.1004 -0.1820 0.0429 -0.1708 0.1450 0.1462 0.1525 -0.4716 -0.3714 -0.5920 0.2730 0.2714 0.1328 -0.4232 -0.5593 0.2539 0.2566 0.1248
va: 1.9495 1.9519 2.2854 0.4934 3.3014 2.9806 0.9905 1.0095 0.9573 -0.7822 0.9901 0.8436 3.2769 3.1609 3.3880 0.8952 3.3630 0.9925 3.3448 0.9336 0.9306 0.9245 1.3023 1.6939 3.7586 0.9067 0.9009 1.0764 1.5384 3.7465 0.9301 0.9336 1.0791
dispcorr: -0.011127278 hartree
energy: -768.924352576037
