program: Gaussian 09
title: 000052734
version: EM64L-G09RevD.01
frameworkgroup: C1[X(C16H10N4)]
method: RPBEPBE
basis: SDD
operation: Freq
keyword: #pfreq=noraman
keyword: PBEPBE/SDD
title: #p freq=noraman PBEPBE/SDD
converged: YES YES NO NO
title: Mulliken charges:
elementType: N N N N C C C C C C C C C C C C C C C C H H H H H H H H H H
charge: -0.188851 0.000725 0.000747 0.011152 -0.583035 0.313003 0.501615 -0.193593 -0.339416 -0.298401 -0.370899 -0.411029 0.241672 -0.224569 -0.223381 -0.235948 0.196048 -0.235074 -0.244882 -0.223800 0.275700 0.234494 0.263821 0.279579 0.261140 0.240085 0.249593 0.232249 0.235873 0.235382
chargesum: 0.00000
title: Mulliken charges with hydrogens summed into heavy atoms:
elementType: N N N N C C C C C C C C C C C C C C C C
charge: -0.188851 0.000725 0.000747 0.011152 -0.072841 0.313003 0.501615 0.070228 -0.059837 -0.037261 -0.130814 -0.161436 0.241672 0.007680 0.012492 -0.000566 0.196048 -0.235074 -0.244882 -0.223800
polarizability: 1.87916451e+02 -1.80452616e+01 2.52638631e+02 2.75556474e+01 7.88767928e+00 1.67451253e+02
1716.lowfreq: -9.7326 -6.6640 -6.2055 -0.0003 0.0001 0.0005 18.2091 25.3768 41.0916
frequency: 18.0686 25.2908 41.0646 63.6139 72.7123 106.2148 118.7202 140.2809 148.5351 177.6857 202.4574 239.7516 257.9113 293.5877 334.1855 358.0366 402.7709 426.3766 438.9946 447.2090 461.4567 498.6539 525.1978 564.1457 575.0446 597.7649 604.1555 615.2645 656.7441 696.1382 708.5437 719.9056 754.0383 762.9055 802.8610 829.8632 853.4232 854.7414 878.6129 899.4357 914.3666 967.6468 980.3698 990.8244 1001.3442 1027.4122 1031.1997 1062.3921 1090.1664 1097.8517 1154.9927 1175.8674 1192.2701 1195.9007 1208.0834 1221.4328 1256.7740 1308.2539 1341.4483 1353.7913 1368.0500 1387.9667 1430.5432 1442.6502 1456.8223 1482.6787 1487.7634 1492.4927 1542.2301 1596.6936 1614.8971 2154.4573 2165.4657 2180.3316 3015.1700 3085.6094 3121.6395 3127.7855 3138.8799 3151.5641 3168.1754 3217.1337 3233.7895 3251.0330
redmass: 7.8122 4.6602 6.7314 5.5250 7.6330 7.3047 9.3323 10.5939 8.5464 6.0468 5.8079 6.9648 6.2090 5.6165 3.3344 9.1530 2.8082 3.9733 6.7306 7.8914 3.6790 7.2738 12.0432 6.9121 4.7864 8.2622 4.0205 6.0552 5.6671 3.6817 2.9382 2.2295 1.2810 2.2719 3.4059 1.6206 4.3441 1.4146 4.7904 1.3948 1.4052 1.8903 1.3962 5.7850 1.3485 2.2815 2.5054 2.1344 1.5852 1.5490 1.7906 1.0631 1.6285 1.5309 4.1917 2.2108 2.2503 1.5168 2.7621 1.8628 2.1401 4.9360 4.6010 2.2596 2.7281 1.8848 5.9038 1.4557 6.4742 6.0353 5.9143 12.6286 12.6383 12.6334 1.0657 1.0969 1.0874 1.0875 1.0912 1.0959 1.1015 1.0917 1.0970 1.1081
irintensity: 0.7717 0.3733 0.0878 0.4262 0.7647 0.3032 1.7782 4.0891 3.0149 5.3910 2.6647 1.7279 4.4184 0.2380 2.1293 6.6738 0.1346 1.6173 4.9528 3.7208 4.6205 2.2849 3.1648 0.9483 8.7097 3.2764 9.9430 0.5100 0.0878 0.3285 45.1801 83.0655 88.7004 6.0078 4.3796 3.2478 6.8069 1.9210 6.5999 0.4454 4.1696 1.3154 0.4669 0.6364 0.3040 6.2004 3.6116 2.4748 10.5642 47.9232 38.1201 0.1602 9.1603 1.1332 4.2423 6.4520 23.9872 7.9225 39.8255 6.3379 3.1380 3.6916 96.2915 23.8077 117.0982 46.2069 11.8889 79.4454 177.8716 1.2768 2.4623 4.2380 17.9120 31.3339 21.4053 3.1335 4.4029 1.7874 8.4333 24.1840 17.6253 1.3930 0.1143 1.1228
temp: 298.150 k
press: 1.00000 atm
elementType: 7 7 7 7 6 6 6 6 6 6 6 6 6 6 6 6 6 6 6 6 1 1 1 1 1 1 1 1 1 1
symmnumber: 1
zpe: 568576.5 jmol-1
zpe.correction: 0.216559 hartree
zpe.thermalcorrener: 0.233885 hartree
zpe.thermalcorrenthalpy: 0.234829 hartree
zpe.thermalcorrgfe: 0.169008 hartree
zpe.sumelectzpe: -833.284538 hartree
zpe.sumelectthermal: -833.267212 hartree
zpe.sumelectthermalent: -833.266268 hartree
zpe.sumelectthermalfe: -833.332089 hartree
dipole: -5.2096 5.7446 -0.7193
dipole: 7.7883
quadrupole: -121.9925 -115.4040 -122.0765
quadrupole: 10.6536 -6.6440 -7.3544
quadrupole: -2.1681 4.4203 -2.2522 10.6536 -6.6440 -7.3544
hfenergy: -833.5010969 hartree
pointgroup: C01 [X(C16H10N4)]
dipole: 1.5268005 2.4264633 1.0816985 debye
polarizability: 156.9025637|17.7993466|254.1227084|20.4289319|-1.8018521|196.9810623 unknown
InChI: InChI=1S/C16H10N4/c17-9-14(10-18)15(11-19)16-7-4-8-20(16)12-13-5-2-1-3-6-13/h1-8H,12H2
charge 0 multiplicity 1
30 atoms
N  -0.276032 1.815943 0.605745
N  -1.456917 -1.492133 2.040157
N  -1.718005 -0.266584 -3.909483
N  -2.49532 -3.59188 -1.112708
C  0.532383 1.262058 1.723294
C  -1.030769 1.113796 -0.373681
C  1.703745 0.393608 1.264435
C  -0.21501 3.149111 0.237564
C  -1.437887 2.0719 -1.34717
C  -0.940181 3.339063 -0.956118
C  2.532623 0.798669 0.188189
C  1.999837 -0.806805 1.954276
C  -1.366644 -0.293571 -0.308177
C  3.642765 0.013374 -0.190749
C  3.115795 -1.589107 1.57984
C  3.939566 -1.181479 0.506488
C  -1.735975 -1.089681 -1.41222
C  -1.39995 -0.951076 0.975826
C  -1.722277 -0.619378 -2.764965
C  -2.1524 -2.451566 -1.237315
H  -0.115988 0.701587 2.41507
H  0.908589 2.140177 2.280339
H  0.343168 3.865591 0.838239
H  -2.066975 1.86593 -2.209826
H  -1.090272 4.286891 -1.468138
H  2.307218 1.720815 -0.361593
H  1.351685 -1.139299 2.774023
H  4.274111 0.330462 -1.028019
H  3.3323 -2.518873 2.116718
H  4.800015 -1.791444 0.210561
