program: Gaussian 09
title: 000052752
version: EM64L-G09RevD.01
frameworkgroup: C1[X(C9H18N2O6)]
method: RPBEPBE
basis: SDD
operation: Freq
keyword: #p
keyword: freq=noraman
keyword: PBEPBE/SDD
title: #p freq=noraman PBEPBE/SDD
converged: YES YES NO NO
title: Mulliken charges:
elementType: O O O O O O N N C C C C C C C C C H H H H H H H H H H H H H H H H H H
charge: -0.268690 -0.268716 -0.197538 -0.197563 -0.223434 -0.223617 0.145095 0.145193 -0.078017 -0.077681 -0.370964 -0.371249 -0.302909 -0.302961 -0.198745 -0.683941 -0.683968 0.258264 0.258137 0.206369 0.240542 0.206342 0.240822 0.201878 0.280013 0.201868 0.280013 0.215122 0.214964 0.236210 0.224233 0.217269 0.236221 0.224284 0.217153
chargesum: 0.00000
title: Mulliken charges with hydrogens summed into heavy atoms:
elementType: O O O O O O N N C C C C C C C C C
charge: -0.268690 -0.268716 -0.197538 -0.197563 -0.223434 -0.223617 0.145095 0.145193 0.180246 0.180457 0.075946 0.075915 0.178983 0.178920 0.231341 -0.006229 -0.006309
polarizability: 1.66124633e+02 1.10012497e-05 1.19315394e+02 -1.33911044e+00 6.35764311e-02 1.24589011e+02
1716.lowfreq: -7.0162 0.0011 0.0013 0.0013 6.9915 11.8084 25.8500 33.7588 42.8449
frequency: 25.7865 32.8919 42.8226 51.7874 56.4378 67.6462 76.0124 83.2823 99.5761 135.6209 139.8452 179.9826 181.6443 201.4546 224.6636 233.9917 239.7383 285.0821 289.1924 317.4124 351.9549 362.5351 393.2626 414.2321 492.8047 528.2048 578.5539 592.2085 625.0966 670.3629 680.2699 766.5689 767.2670 805.3106 805.8970 859.8582 865.3660 917.8597 918.6503 963.0845 977.2625 988.2121 1037.1612 1048.7300 1062.8499 1072.9735 1073.4716 1098.6774 1124.4512 1125.3133 1133.3168 1141.1612 1201.7828 1207.0021 1226.2596 1229.0099 1242.4043 1258.7893 1262.8060 1275.7928 1278.0501 1304.3522 1307.8654 1345.5724 1345.8797 1365.2863 1381.5491 1382.5102 1403.6554 1404.0005 1434.4995 1434.9925 1451.5676 1460.5125 1461.4672 1473.8458 1478.6466 1478.9270 1483.5609 1483.7188 1486.4076 2966.6997 2966.8784 2980.7749 2989.4752 2989.7984 2994.0725 2994.3547 3045.6029 3045.9437 3046.0955 3047.9775 3057.1264 3076.4747 3076.5314 3087.8950 3088.2527 3092.1077 3092.5361
redmass: 4.2413 5.5676 7.8514 4.6047 12.2193 6.0467 2.2915 2.5577 5.3279 4.5412 3.3078 2.0009 2.0508 2.8934 5.6311 1.4912 1.6743 2.9931 3.0463 2.4198 4.9519 4.3222 3.4548 3.8505 5.2512 4.3818 3.6013 2.7658 4.3907 4.4186 4.2366 3.0769 3.0264 1.7300 1.7494 6.0360 4.9954 1.7610 1.7498 2.7026 1.5702 2.4972 3.9587 3.3261 4.8604 1.7632 1.7784 1.8771 2.0677 2.0856 2.3515 2.1115 1.4646 1.8425 1.7873 1.5178 1.1998 1.9150 1.8462 1.2972 1.2207 1.4032 1.3724 1.5449 1.5414 1.1973 1.3957 1.3734 1.2029 1.2028 3.0552 3.2723 1.0932 1.0986 1.0923 1.0757 1.0477 1.0502 1.0583 1.0587 1.0915 1.0613 1.0609 1.0529 1.0362 1.0362 1.0607 1.0607 1.1016 1.0986 1.0995 1.0999 1.1133 1.0907 1.0906 1.0989 1.0990 1.1003 1.1004
irintensity: 2.1216 5.8244 1.4930 0.0543 0.0161 1.0764 0.7407 0.8105 1.2100 0.9540 0.0491 1.1985 4.5286 20.4671 3.4924 0.4460 6.4077 2.1675 2.1782 8.4626 6.0619 2.3785 7.2313 1.6582 11.1873 14.2669 0.4892 2.8922 0.0221 2.2567 0.8929 37.0059 8.7266 5.9452 0.7575 0.1871 49.3655 8.6703 10.9039 86.7012 0.1188 170.8059 35.1059 30.2341 85.5236 4.4227 2.4840 10.7786 10.6333 1.8555 1.9016 7.7352 20.6058 46.9322 1.0531 25.0835 0.0389 35.9407 9.3840 20.8533 1.4349 105.4289 1.0292 0.2117 0.2600 4.9971 5.3187 31.5675 18.4235 18.2220 240.6244 15.8629 1.3765 0.5567 0.3169 7.5011 2.8575 25.6483 16.7286 17.3337 5.9294 55.1726 22.5947 92.3896 27.1612 21.5514 15.3733 25.5491 0.8510 6.4178 1.8983 5.0897 27.6500 0.8317 2.0309 33.5304 38.7642 38.7264 32.9606
temp: 298.150 k
press: 1.00000 atm
elementType: 8 8 8 8 8 8 7 7 6 6 6 6 6 6 6 6 6 1 1 1 1 1 1 1 1 1 1 1 1 1 1 1 1 1 1
symmnumber: 1
zpe: 738078.6 jmol-1
zpe.correction: 0.281119 hartree
zpe.thermalcorrener: 0.300859 hartree
zpe.thermalcorrenthalpy: 0.301804 hartree
zpe.thermalcorrgfe: 0.230337 hartree
zpe.sumelectzpe: -913.036436 hartree
zpe.sumelectthermal: -913.016696 hartree
zpe.sumelectthermalent: -913.015752 hartree
zpe.sumelectthermalfe: -913.087219 hartree
dipole: 0.0165 1.9363 -0.0077
dipole: 1.9363
quadrupole: -96.3162 -97.7502 -109.2264
quadrupole: 0.1411 25.2999 -0.0416
quadrupole: 4.7814 3.3474 -8.1288 0.1411 25.2999 -0.0416
hfenergy: -913.3175553 hartree
pointgroup: C01 [X(C9H18N2O6)]
dipole: -0.0106928 0.7586022 -0.0690888 debye
polarizability: 165.7545343|-0.1291872|119.3515078|-4.1251348|0.44905|124.9229955 unknown
InChI: InChI=1S/C9H18N2O6/c1-3-8(10(12)13)5-16-7-17-6-9(4-2)11(14)15/h8-9H,3-7H2,1-2H3
charge 0 multiplicity 1
35 atoms
O  -1.132632 2.132372 0.122876
O  1.196691 2.084097 -0.576022
O  -3.125535 -0.007126 2.182411
O  3.211499 -0.372733 -2.213148
O  -1.165499 -0.770996 1.310362
O  1.257786 -0.987122 -1.217744
N  -2.297841 -0.166632 1.213862
N  2.384085 -0.364179 -1.231327
C  -2.724535 0.355726 -0.174147
C  2.802462 0.40394 0.039878
C  -3.217368 -0.840434 -1.024486
C  3.300549 -0.615651 1.093438
C  -1.546249 1.080252 -0.824123
C  1.617219 1.224987 0.546256
C  0.025861 2.897214 -0.300749
C  -4.45032 -1.560251 -0.441202
C  4.544241 -1.414548 0.653833
H  -3.546089 1.055545 0.05344
H  3.61999 1.057432 -0.308204
H  -3.459197 -0.439911 -2.028351
H  -2.378045 -1.54962 -1.154953
H  3.53151 -0.039722 2.010804
H  2.466799 -1.29867 1.343807
H  -1.880911 1.529054 -1.782944
H  -0.712857 0.3802 -1.019145
H  1.947041 1.842697 1.407976
H  0.788554 0.566109 0.864276
H  0.197607 3.600348 0.536658
H  -0.154959 3.429478 -1.254214
H  -4.232157 -2.016792 0.540125
H  -4.777351 -2.366091 -1.121599
H  -5.297207 -0.863085 -0.305645
H  4.337588 -2.040106 -0.232137
H  4.873538 -2.083386 1.468319
H  5.385632 -0.743696 0.401718
