program: Orca
programVersion: 6.0.x
elementType: C N C H H O H H O H H C H H C H H F O C H H H
charge: 1
multiplicity: 1
keywords: wB97X-D3 def2-TZVPPD autoaux TightSCF
formula: C5H13FNO3
InChI: InChI=1/C5H9FNO.2H2O/c1-8-4-5(7)2-3-6;;/h2-4H2,1H3;2*1H2
23 atoms
C  -0.100342 0.572032 -0.519887
N  1.028957 0.986088 -0.601722
C  -0.596013 0.859649 -2.14463
H  -1.536582 1.368735 -1.918206
H  0.123773 1.512181 -2.642371
O  1.785514 0.790936 1.371931
H  1.825837 -0.14074 1.680842
H  2.684527 1.130563 1.302976
O  1.288813 -1.727543 2.241251
H  1.78734 -2.541475 2.115407
H  0.94166 -1.761846 3.139608
C  -1.055244 -0.062059 0.427073
H  -1.923813 -0.440302 -0.115222
H  -0.522407 -0.904598 0.882428
C  -1.470174 0.920817 1.53355
H  -2.116723 1.715947 1.152359
H  -0.594431 1.348465 2.026135
F  -2.18709 0.187303 2.456781
O  -0.795712 -0.337854 -2.694646
C  0.304335 -0.89041 -3.435689
H  1.149896 -1.07226 -2.764303
H  -0.056318 -1.829164 -3.849244
H  0.594815 -0.207784 -4.238485
totalener: -578.35163343187901 hartree
nucrepener: 574.02823497548729 hartree
electener: -1152.37981626975898 hartree
oneelecener: -1917.82950640587183 hartree
twoeener: 765.44969013611296 hartree
kineticenergy: 575.88232240391733 hartree
xcener: -51.816262835572 hartree
energy: -677.6134 -529.1638 -527.9181 -527.9155 -399.6135 -287.4637 -286.7187 -285.7854 -285.1334 -285.0136 -39.3019 -37.3545 -35.3334 -34.9954 -33.9994 -29.1268 -28.0488 -25.3838 -25.0309 -22.1731 -21.9862 -21.7121 -21.3093 -21.2726 -21.0133 -20.3982 -19.7043 -19.5170 -18.9827 -18.7098 -18.2355 -17.9325 -17.6465 -17.5648 -17.1469 -16.5081 -16.0049 -15.8932 -15.7872 -15.5529 -14.6518 -5.6350 -2.8919 -1.8911 -1.3920 -1.0948 -0.9634 -0.6973 -0.4967 -0.3629 -0.1842 0.0243 electronvolt
chargesum: 1.0000000
charge: 0.587015 -0.285337 -0.070697 0.237170 0.222953 -0.405722 0.332750 0.156093 -0.367199 0.162792 0.200431 0.119023 0.136062 0.109038 -0.056984 0.189871 0.164250 -0.328655 -0.340004 -0.309613 0.212903 0.143944 0.189916
charge: -0.188388 0.374783 0.041489 0.065844 0.045130 0.437654 -0.230734 -0.143781 0.470146 -0.154292 -0.149708 0.082296 0.044541 0.022268 -0.021634 0.044521 0.029114 0.013616 -0.035328 0.190216 0.016459 0.023270 0.022520
qa: 0.5870 -0.2853 -0.0707 0.2372 0.2230 -0.4057 0.3327 0.1561 -0.3672 0.1628 0.2004 0.1190 0.1361 0.1090 -0.0570 0.1899 0.1642 -0.3287 -0.3400 -0.3096 0.2129 0.1439 0.1899
va: 3.3478 2.0440 3.6413 0.9606 0.9801 2.1887 0.9058 1.0052 2.0511 1.0621 1.0393 3.8458 1.1204 1.0159 3.5674 1.0003 1.0697 0.8542 1.8698 3.7763 0.9903 1.0638 1.0109
dispcorr: -0.008382905 hartree
energy: -578.360016336731
