program: Orca
programVersion: 6.0.x
elementType: C N C H H O H H O H H C H H C C H H H O C H H H
charge: 1
multiplicity: 1
keywords: wB97X-D3 def2-TZVPPD autoaux TightSCF
formula: C6H14NO3
InChI: InChI=1/C6H10NO.2H2O/c1-3-4-6(7)5-8-2;;/h3H,1,4-5H2,2H3;2*1H2
24 atoms
C  -0.262487 0.375899 0.259374
N  0.470972 1.026684 -0.438166
C  -1.748934 0.699579 -0.530948
H  -2.339599 0.838829 0.381963
H  -1.667466 1.609904 -1.127342
O  2.403398 0.644591 0.445532
H  2.928849 0.192905 -0.254077
H  2.782931 1.523954 0.550652
O  3.813183 -0.724255 -1.419983
H  4.138421 -0.388491 -2.26043
H  4.43949 -1.394711 -1.130394
C  -0.317677 -0.539072 1.446414
H  -0.808009 -1.459569 1.114462
H  0.725476 -0.744873 1.699719
C  -1.067369 0.105293 2.583344
C  -2.263552 -0.312331 2.995718
H  -0.571131 0.93754 3.076569
H  -2.761922 0.161902 3.834383
H  -2.770071 -1.15502 2.531123
O  -2.087313 -0.413494 -1.184856
C  -1.719838 -0.466613 -2.571258
H  -0.630288 -0.412633 -2.669085
H  -2.084632 -1.420764 -2.944249
H  -2.191433 0.357655 -3.11312
totalener: -517.18805516972157 hartree
nucrepener: 538.40936716018120 hartree
electener: -1055.59741954380729 hartree
oneelecener: -1759.44044520065609 hartree
twoeener: 703.84302565684879 hartree
kineticenergy: 514.81442714877983 hartree
xcener: -48.267184842338 hartree
energy: -528.9296 -527.4707 -527.4141 -399.2187 -287.1337 -286.3790 -284.9296 -284.8584 -283.8300 -283.4177 -37.1069 -34.8719 -34.5325 -33.6550 -29.3623 -27.8035 -26.6669 -25.0930 -22.5387 -21.7332 -21.3859 -21.2664 -21.0038 -20.9483 -20.5404 -19.3885 -18.9443 -18.8209 -18.3205 -17.8636 -17.6036 -17.1087 -17.0464 -16.7704 -16.2925 -15.9360 -15.6104 -15.3959 -14.3808 -13.6808 -5.3681 -2.7093 -1.5961 -1.2542 -1.1039 -0.9299 -0.6919 -0.4829 -0.3135 -0.2502 -0.0421 electronvolt
chargesum: 1.0000000
charge: 0.617065 -0.353878 -0.080763 0.261107 0.240548 -0.432470 0.351266 0.162078 -0.348652 0.185461 0.185511 0.360479 0.144180 0.182344 -0.485007 -0.343934 0.141228 0.156118 0.162656 -0.329995 -0.312447 0.208436 0.144604 0.184066
charge: -0.190718 0.368811 0.042396 0.049944 0.046545 0.431168 -0.245466 -0.150716 0.479426 -0.161547 -0.159870 0.042720 0.045937 0.029737 -0.037973 0.212985 0.017244 -0.017374 -0.012083 -0.035578 0.185518 0.014536 0.022377 0.021981
qa: 0.6171 -0.3539 -0.0808 0.2611 0.2405 -0.4325 0.3513 0.1621 -0.3487 0.1855 0.1855 0.3605 0.1442 0.1823 -0.4850 -0.3439 0.1412 0.1561 0.1627 -0.3300 -0.3124 0.2084 0.1446 0.1841
va: 3.0171 2.0965 3.8192 0.9085 0.9710 2.1413 0.8922 1.0609 2.0401 1.0169 1.0210 3.0761 1.0149 1.0347 3.5347 3.7142 1.0288 1.0134 0.9615 1.8287 3.7744 0.9816 1.0642 1.0193
dispcorr: -0.007692130 hartree
energy: -517.195747299630
