program: Orca
programVersion: 6.0.x
elementType: C N C H H O H H O H H C H H C H H H O C H H H
charge: 1
multiplicity: 1
keywords: wB97X-D3 def2-TZVPPD autoaux TightSCF
formula: C5H14NO3
InChI: InChI=1/C5H10NO.2H2O/c1-3-5(6)4-7-2;;/h3-4H2,1-2H3;2*1H2
23 atoms
C  -0.481141 0.249657 0.568895
N  0.158012 0.96413 -0.1578
C  -2.045368 0.660695 -0.054195
H  -2.541258 0.790233 0.911212
H  -1.991172 1.588457 -0.62606
O  2.18299 0.526117 0.454343
H  2.633326 0.189973 -0.354013
H  2.568553 1.388755 0.643153
O  3.402563 -0.519523 -1.729283
H  3.617618 -0.061058 -2.546841
H  4.072551 -1.199516 -1.610071
C  -0.414637 -0.756523 1.664939
H  -1.157087 -1.529424 1.447677
H  0.586551 -1.188753 1.605684
C  -0.657973 -0.109225 3.034037
H  -1.650116 0.344027 3.109013
H  -0.59282 -0.885195 3.798884
H  0.096288 0.649539 3.24999
O  -2.482748 -0.41811 -0.702054
C  -2.240353 -0.449798 -2.117605
H  -1.162246 -0.44806 -2.30845
H  -2.684409 -1.374736 -2.477641
H  -2.71448 0.411027 -2.59638
totalener: -479.10929890032907 hartree
nucrepener: 473.90424766846411 hartree
electener: -953.01358918412052 hartree
oneelecener: -1580.45992223452936 hartree
twoeener: 627.44633305040884 hartree
kineticenergy: 476.91348766436420 hartree
xcener: -44.530682239397 hartree
energy: -529.0265 -527.4478 -527.4090 -399.2436 -287.3121 -286.4137 -284.9946 -284.7943 -283.5380 -37.2175 -34.8640 -34.5283 -33.7007 -28.9788 -27.8596 -25.1807 -25.0068 -21.8738 -21.3767 -21.2642 -21.1230 -21.0462 -20.4819 -19.3163 -19.0748 -18.4520 -17.9886 -17.8517 -17.6666 -17.0049 -16.7559 -16.4940 -16.3657 -16.2707 -15.6068 -15.3932 -14.3540 -5.2979 -2.4848 -1.6228 -1.2687 -0.9525 -0.7382 -0.5679 -0.4017 -0.2724 -0.0827 0.1001 electronvolt
chargesum: 1.0000000
charge: 0.585692 -0.330271 -0.005745 0.200388 0.230364 -0.424798 0.345470 0.160197 -0.349907 0.187540 0.185894 0.155721 0.176006 0.187151 -0.821633 0.211872 0.198226 0.206833 -0.337551 -0.292330 0.199565 0.146668 0.184647
charge: -0.197605 0.365737 0.044987 0.057250 0.044996 0.432425 -0.246268 -0.151525 0.479061 -0.161661 -0.160160 0.021523 0.039331 0.030461 0.180473 -0.004388 0.005990 0.005053 -0.035097 0.189339 0.014999 0.022931 0.022148
qa: 0.5857 -0.3303 -0.0057 0.2004 0.2304 -0.4248 0.3455 0.1602 -0.3499 0.1875 0.1859 0.1557 0.1760 0.1872 -0.8216 0.2119 0.1982 0.2068 -0.3376 -0.2923 0.1996 0.1467 0.1846
va: 3.1996 2.1270 3.7510 1.0115 0.9886 2.1672 0.8995 1.0639 2.0377 1.0158 1.0200 3.4091 1.0478 1.0306 3.8820 1.0295 1.0827 1.0666 1.8497 3.7696 0.9941 1.0613 1.0170
dispcorr: -0.007036442 hartree
energy: -479.116335342272
