program: Orca
programVersion: 6.0.x
elementType: C N C H H O H H O H H C C C C H C H C H H O C H H H O C H H H
charge: 1
multiplicity: 1
keywords: wB97X-D3 def2-TZVPPD autoaux TightSCF
formula: C10H16NO4
InChI: InChI=1/C10H12NO2.2H2O/c1-12-7-10(11)8-3-5-9(13-2)6-4-8;;/h3-6H,7H2,1-2H3;2*1H2
31 atoms
C  1.20822 0.841245 -0.396648
N  2.228766 1.080021 0.240765
C  1.93438 1.101677 -1.892195
H  1.174199 1.744065 -2.344434
H  2.87686 1.641217 -1.776071
O  1.865286 0.848083 2.241506
H  2.407571 0.048532 2.446929
H  2.349877 1.609451 2.581724
O  3.255196 -1.403941 2.741425
H  4.210055 -1.471601 2.834274
H  2.873696 -2.083449 3.30566
C  -0.184743 0.472099 -0.325897
C  -0.847675 0.489256 0.91285
C  -0.896216 0.108764 -1.489215
C  -2.191611 0.16719 0.993083
H  -0.305589 0.76298 1.808974
C  -2.229258 -0.220138 -1.409331
H  -0.40006 0.05093 -2.451345
C  -2.894613 -0.189568 -0.169167
H  -2.683576 0.198345 1.95687
H  -2.788993 -0.509864 -2.290936
O  -4.185834 -0.515549 -0.201282
C  -4.944915 -0.510262 1.004178
H  -4.960521 0.488858 1.450601
H  -5.954206 -0.795322 0.714378
H  -4.548179 -1.240008 1.717163
O  2.025689 -0.085244 -2.526358
C  3.258927 -0.78892 -2.350668
H  3.4213 -1.007602 -1.289841
H  3.159995 -1.716563 -2.910134
H  4.090454 -0.197315 -2.745796
totalener: -746.07972720357964 hartree
nucrepener: 993.38932006302650 hartree
electener: -1739.46904011268794 hartree
oneelecener: -2972.95834324647421 hartree
twoeener: 1233.48930313378628 hartree
kineticenergy: 742.67648476482134 hartree
xcener: -69.868018443973 hartree
energy: -528.2304 -527.7271 -527.5202 -527.4929 -398.7851 -286.5365 -286.0349 -285.1408 -284.4762 -284.0790 -283.8758 -283.6594 -283.6587 -283.1507 -283.0491 -36.4204 -35.7051 -35.0439 -34.6583 -33.1718 -30.2378 -27.7491 -27.3871 -27.0684 -25.6227 -24.6504 -23.5771 -23.0342 -21.7111 -21.5709 -21.3664 -20.7741 -20.5309 -20.3910 -20.1828 -19.3940 -18.8941 -18.7517 -18.5359 -18.1323 -17.7628 -17.6337 -17.5917 -17.2283 -16.9514 -16.8659 -16.8377 -16.3114 -15.8649 -15.7817 -15.4806 -15.1971 -14.8062 -14.6548 -13.9208 -12.9469 -11.8800 -4.5275 -3.2152 -1.7607 -1.5857 -0.9864 -0.7710 -0.6709 -0.4410 -0.2626 -0.1474 -0.1253 electronvolt
chargesum: 1.0000000
charge: 1.054011 -0.381006 -0.077799 0.280236 0.203314 -0.439766 0.385253 0.154316 -0.340920 0.176723 0.183952 0.507580 -0.854422 -0.522186 0.154948 0.242715 -0.494942 0.046737 0.990269 0.079903 0.104727 -0.464337 -0.476632 0.226237 0.144794 0.226805 -0.321269 -0.290699 0.179319 0.145380 0.176758
charge: -0.164722 0.343371 0.016022 0.061241 0.041732 0.429043 -0.236344 -0.137515 0.484721 -0.159250 -0.157961 -0.134477 0.095340 0.082528 0.100472 0.001572 0.115182 0.017223 -0.219171 0.012111 0.032907 0.001108 0.153933 0.018265 0.019680 0.018383 -0.061620 0.173921 0.010973 0.020888 0.020446
qa: 1.0540 -0.3810 -0.0778 0.2802 0.2033 -0.4398 0.3853 0.1543 -0.3409 0.1767 0.1840 0.5076 -0.8544 -0.5222 0.1549 0.2427 -0.4949 0.0467 0.9903 0.0799 0.1047 -0.4643 -0.4766 0.2262 0.1448 0.2268 -0.3213 -0.2907 0.1793 0.1454 0.1768
va: 1.4094 1.9546 3.7297 0.8513 0.9945 2.2043 0.8523 1.0762 2.0517 1.0237 1.0219 1.0783 2.6949 2.8487 2.8118 0.7473 3.5815 0.9636 2.4695 0.9197 1.0160 1.5967 3.8147 0.9579 1.0502 0.9635 1.7982 3.7691 1.0146 1.0502 1.0199
dispcorr: -0.011228590 hartree
energy: -746.090955793806
