program: Gaussian 09
title: 000052735
version: EM64L-G09RevD.01
frameworkgroup: C1[X(C14H10Cl4O)]
method: RPBEPBE
basis: SDD
operation: Freq
keyword: #p
keyword: freq=noraman
keyword: PBEPBE/SDD
title: #p freq=noraman PBEPBE/SDD
converged: NO NO NO NO
title: Mulliken charges:
elementType: Cl Cl Cl Cl O C C C C C C C C C C C C C C H H H H H H H H H H
charge: -0.045411 -0.045403 -0.045411 -0.045394 -0.252572 -0.343921 -0.343943 0.639943 0.639938 -0.283567 -0.283571 -0.283551 -0.283561 -0.242963 -0.242957 -0.242959 -0.242953 -0.207886 -0.207870 0.208848 0.208845 0.208862 0.208862 0.261388 0.261387 0.261387 0.261388 0.241522 0.241521
chargesum: 0.00000
title: Mulliken charges with hydrogens summed into heavy atoms:
elementType: Cl Cl Cl Cl O C C C C C C C C C C C C C C
charge: -0.045411 -0.045403 -0.045411 -0.045394 -0.252572 0.073772 0.073782 0.639943 0.639938 -0.283567 -0.283571 -0.283551 -0.283561 0.018424 0.018430 0.018428 0.018435 0.033637 0.033651
polarizability: 2.02354194e+02 -4.52156650e-04 2.32262475e+02 -8.94734589e-03 -4.63836966e-03 1.25554829e+02
1716.lowfreq: 0.0011 0.0023 0.0029 2.6653 6.3834 11.6061 13.1187 14.2206 16.4753
frequency: 12.6311 13.4363 16.2552 36.8351 59.1975 75.8563 119.0580 160.2337 175.1746 192.9574 193.1373 209.1284 254.4606 281.2949 302.7122 305.3571 335.9823 382.6887 383.1214 386.0284 390.9919 472.4018 472.5093 515.3280 523.4500 523.8728 536.4924 603.9350 630.0600 708.9359 720.1274 724.3878 733.8880 778.1997 778.2568 813.9919 842.6137 894.8937 895.0142 913.7161 970.3605 971.2421 971.4837 998.7300 1000.6609 1049.6892 1051.1097 1068.2860 1069.0113 1153.4564 1157.1590 1176.8227 1187.2211 1215.0963 1219.9823 1226.9009 1230.8325 1337.1136 1366.4750 1367.4681 1402.9545 1417.8696 1419.1111 1435.0564 1437.8289 1469.9806 1481.0535 1562.7536 1564.2427 1593.4375 1593.8582 2952.9416 2958.1483 3004.9358 3010.1292 3149.2397 3149.2545 3172.9134 3172.9343 3183.0688 3183.1080
redmass: 14.0743 15.2332 12.3032 5.7475 9.8558 20.9698 6.9551 9.1180 12.1851 4.5914 4.6038 13.7553 10.6694 6.2277 3.2553 3.4526 10.7130 5.8689 5.8082 10.6253 6.3233 4.2424 3.9128 3.9432 5.4348 5.4363 4.6045 4.7174 5.5981 4.2524 7.4307 7.5569 4.0256 1.4261 1.3687 5.4616 4.5874 1.3578 1.3579 9.4120 1.5979 1.3288 1.3334 11.5980 1.6450 4.7827 4.4069 2.7061 2.7039 1.4605 1.3569 1.1326 1.2931 2.4320 2.3695 1.2595 1.2461 1.1926 7.7355 7.5078 1.3657 2.1605 2.1680 3.2704 3.3214 1.0998 1.0817 6.6692 6.6857 8.2417 8.2904 1.0559 1.0548 1.1054 1.1069 1.0877 1.0877 1.0930 1.0930 1.0994 1.0994
irintensity: 0.4553 0.0000 0.0000 1.1121 1.3489 0.4169 2.6431 1.5326 0.2337 0.0000 0.0024 4.0000 0.0134 4.7461 3.6599 0.0000 7.0768 12.5730 0.0003 5.6686 1.7009 3.9616 0.0006 0.0630 0.0000 0.0001 0.0798 0.1764 1.0726 24.3363 0.0005 129.9502 20.4114 45.5158 71.5042 0.5899 0.2006 0.0000 0.0032 17.2485 0.0000 1.3562 0.4449 159.7744 42.1067 48.6356 12.6103 15.2983 10.9340 0.0000 9.5573 0.0001 33.6069 5.4847 2.1385 0.0000 0.6783 44.4333 0.0030 0.8880 6.9367 0.0032 121.6133 2.3068 3.8467 8.5495 12.5304 0.0336 96.5714 21.1457 41.5492 16.6172 88.7427 25.2113 0.0012 6.0662 3.9994 0.7988 1.3649 9.4744 3.8759
temp: 298.150 k
press: 1.00000 atm
elementType: 17 17 17 17 8 6 6 6 6 6 6 6 6 6 6 6 6 6 6 1 1 1 1 1 1 1 1 1 1
symmnumber: 1
zpe: 523201.9 jmol-1
zpe.correction: 0.199277 hartree
zpe.thermalcorrener: 0.217393 hartree
zpe.thermalcorrenthalpy: 0.218338 hartree
zpe.thermalcorrgfe: 0.147772 hartree
zpe.sumelectzpe: -2453.574088 hartree
zpe.sumelectthermal: -2453.555972 hartree
zpe.sumelectthermalent: -2453.555028 hartree
zpe.sumelectthermalfe: -2453.625594 hartree
dipole: -0.0001 -0.0001 0.7649
dipole: 0.7649
quadrupole: -109.8465 -142.3603 -130.3005
quadrupole: 0.0001 -0.0022 -0.0002
quadrupole: 17.6560 -14.8579 -2.7980 0.0001 -0.0022 -0.0002
hfenergy: -2453.7733654 hartree
pointgroup: C01 [X(C14H10Cl4O1)]
dipole: -0.0000553 0.0000541 -0.3009283 debye
polarizability: 202.3541949|-0.0038775|232.2624741|0.008948|-0.0046371|125.554829 unknown
InChI: InChI=1S/C14H10Cl4O/c15-11-3-1-4-12(16)9(11)7-19-8-10-13(17)5-2-6-14(10)18/h1-6H,7-8H2
charge 0 multiplicity 1
29 atoms
Cl 2.324633 2.811214 0.528483
Cl -2.324826 -2.8112 0.52824
Cl 2.325611 -2.810599 0.528397
Cl -2.325417 2.810559 0.527886
O  0.000038 -0.000048 0.558264
C  1.215267 0.00009 1.39799
C  -1.215407 -0.000156 1.397774
C  2.407095 0.000323 0.46951
C  -2.406999 -0.000335 0.469164
C  2.998851 1.200266 -0.00557
C  -2.99881 -1.200269 -0.006051
C  2.999265 -1.199401 -0.005603
C  -2.999057 1.199424 -0.00618
C  4.096542 1.22558 -0.887351
C  -4.096318 -1.22553 -0.888052
C  4.097029 -1.224314 -0.887295
C  -4.096635 1.224359 -0.888102
C  4.64368 0.000728 -1.327245
C  -4.643269 -0.000664 -1.328109
H  1.227636 -0.905073 2.040122
H  1.227351 0.90518 2.040228
H  -1.227743 0.904991 2.039916
H  -1.227518 -0.905239 2.040005
H  4.509534 2.181123 -1.221356
H  -4.509305 -2.181059 -1.222103
H  4.510392 -2.179705 -1.221285
H  -4.509875 2.179757 -1.22221
H  5.497036 0.000882 -2.01306
H  -5.496479 -0.000785 -2.014106
