program: Orca
programVersion: 6.0.x
elementType: C N C H H O H H C H H C C C C H C H N H H F
charge: 1
multiplicity: 1
keywords: wB97X-D3 def2-TZVPPD autoaux TightSCF
formula: C8H10FN2O
InChI: InChI=1/C8H8FN2.H2O/c9-4-1-8(10)7-2-5-11-6-3-7;/h2-3,5-6H,1,4H2;1H2
22 atoms
C  0.651923 0.605745 0.304452
N  1.678129 1.24985 0.309074
C  -0.05521 2.066674 0.591269
H  -0.61593 1.807251 1.496508
H  0.61386 2.887137 0.87231
O  3.373061 -0.295207 -0.108813
H  3.961426 0.133747 -0.740677
H  3.90594 -0.456225 0.678407
C  -0.866176 2.461161 -0.645062
H  -0.201526 2.696514 -1.480544
H  -1.586798 1.694319 -0.938111
C  -0.05677 -0.654075 0.162086
C  0.629096 -1.753546 -0.36327
C  -1.395343 -0.775517 0.545701
C  -0.084314 -2.945049 -0.481223
H  1.669976 -1.680251 -0.654628
C  -1.995704 -2.020862 0.384952
H  -1.965538 0.048625 0.960301
N  -1.360405 -3.079985 -0.119714
H  0.397965 -3.829238 -0.886344
H  -3.032309 -2.16982 0.670512
F  -1.55223 3.592118 -0.274304
totalener: -595.12029745493805 hartree
nucrepener: 667.09221120901088 hartree
electener: -1262.21252628089405 hartree
oneelecener: -2119.06987139240528 hartree
twoeener: 856.85734511151111 hartree
kineticenergy: 592.48079171077541 hartree
xcener: -55.155587603265 hartree
energy: -678.4414 -528.1097 -400.5560 -396.7454 -288.0164 -286.9816 -286.6926 -285.9455 -284.9786 -284.9312 -284.8891 -284.6996 -40.1747 -35.7755 -35.2617 -33.2858 -30.4705 -29.3268 -28.4175 -26.1390 -25.6169 -24.7186 -23.0606 -21.8755 -21.8056 -21.5414 -20.8962 -20.6861 -20.4632 -20.0651 -19.7373 -19.0366 -18.9728 -18.7462 -18.6562 -18.0160 -17.8550 -16.8656 -16.7750 -16.5442 -15.8105 -14.9426 -13.9587 -13.7469 -5.6913 -4.9523 -2.8360 -1.9431 -1.7334 -1.4678 -1.2667 -1.1137 -0.8528 -0.6075 -0.4020 electronvolt
chargesum: 1.0000000
charge: 0.480472 -0.206001 0.171169 0.189122 0.141807 -0.342191 0.178081 0.187086 -0.129758 0.194127 0.206452 0.595626 -0.319877 -0.033172 0.022684 0.260202 -0.109367 0.112154 -0.571912 0.138240 0.136222 -0.301167
charge: -0.147976 0.379136 0.137918 0.054224 0.049608 0.439849 -0.154258 -0.152272 -0.021335 0.053500 0.039112 -0.124417 0.116412 0.090447 -0.002241 0.001463 -0.007088 0.020902 0.133104 0.029854 0.029279 0.034779
qa: 0.4805 -0.2060 0.1712 0.1891 0.1418 -0.3422 0.1781 0.1871 -0.1298 0.1941 0.2065 0.5956 -0.3199 -0.0332 0.0227 0.2602 -0.1094 0.1122 -0.5719 0.1382 0.1362 -0.3012
va: 2.6131 2.2962 3.6717 0.9449 1.0755 2.1419 1.0516 1.0518 3.7168 1.0016 1.0114 1.7315 3.2716 2.9870 3.3162 0.7933 3.4008 0.8988 2.1370 0.9649 0.9636 0.8907
dispcorr: -0.007777204 hartree
energy: -595.128074659021
