program: Orca
programVersion: 6.0.x
elementType: C N C H H O H H O H H C H H C F F F C H H F
charge: 1
multiplicity: 1
keywords: wB97X-D3 def2-TZVPPD autoaux TightSCF
formula: C5H10F4NO2
InChI: InChI=1/C5H6F4N.2H2O/c6-2-1-4(10)3-5(7,8)9;;/h1-3H2;2*1H2
22 atoms
C  0.256416 0.35613 -0.350889
N  0.895369 1.028119 -1.101479
C  -0.907157 0.730075 -1.557538
H  -1.657438 1.130403 -0.867855
H  -0.685201 1.522031 -2.279816
O  2.800662 0.750085 0.567851
H  3.549857 0.223412 0.221008
H  3.180599 1.566859 0.904182
O  4.788912 -0.847786 -0.440343
H  5.322622 -0.627885 -1.209652
H  5.340135 -1.397256 0.124868
C  0.089548 -0.477304 0.855251
H  0.095384 -1.533975 0.571925
H  0.983045 -0.25609 1.451933
C  -1.189369 -0.15542 1.627068
F  -1.185874 -0.792829 2.787004
F  -1.28985 1.163338 1.842316
F  -2.273781 -0.53594 0.926007
C  -1.228403 -0.575653 -2.281941
H  -0.351552 -0.946063 -2.820541
H  -1.617769 -1.338201 -1.602813
F  -2.212018 -0.248691 -3.180891
totalener: -800.91046418283099 hartree
nucrepener: 779.68472591370119 hartree
electener: -1580.59521784355297 hartree
oneelecener: -2637.53239948537430 hartree
twoeener: 1056.93718164182133 hartree
kineticenergy: 797.84237076931879 hartree
xcener: -67.597722485269 hartree
energy: -679.7198 -679.6939 -679.6362 -678.5246 -527.3404 -526.9303 -400.6013 -291.2789 -288.4170 -287.3008 -286.8134 -286.3841 -43.4643 -41.0180 -40.9550 -40.2703 -36.0826 -34.6874 -34.1240 -30.5916 -29.3808 -26.4333 -25.6825 -24.0445 -23.6072 -23.3877 -22.6361 -21.8161 -21.2967 -21.2230 -21.0024 -20.8772 -20.4938 -20.2390 -19.9534 -19.8147 -19.4568 -18.9117 -18.8072 -18.7387 -18.3967 -18.3160 -17.7869 -17.6018 -16.9085 -16.7069 -16.5964 -15.3065 -14.9888 -5.3453 -3.8698 -2.0047 -1.8023 -1.2808 -1.1782 -0.9032 -0.6389 -0.6205 -0.2098 -0.0502 electronvolt
chargesum: 1.0000000
charge: 0.097538 -0.188399 0.315200 0.186871 0.146272 -0.454431 0.311167 0.127186 -0.354347 0.183893 0.186427 0.054611 0.197854 0.202167 0.913304 -0.281991 -0.287306 -0.281332 -0.154997 0.194351 0.192334 -0.306371
charge: -0.126196 0.390891 0.171205 0.048291 0.052989 0.415596 -0.257973 -0.168784 0.470666 -0.164957 -0.164298 0.174632 0.073592 0.044067 -0.590481 0.196184 0.170342 0.154294 -0.025866 0.053398 0.041360 0.041050
qa: 0.0975 -0.1884 0.3152 0.1869 0.1463 -0.4544 0.3112 0.1272 -0.3543 0.1839 0.1864 0.0546 0.1979 0.2022 0.9133 -0.2820 -0.2873 -0.2813 -0.1550 0.1944 0.1923 -0.3064
va: 3.6374 2.3098 3.5138 1.0041 1.0705 2.0980 0.9398 1.0973 2.0306 1.0227 1.0213 3.9438 0.9342 1.0121 3.1572 0.8812 0.8866 0.9191 3.6929 1.0049 1.0190 0.8669
dispcorr: -0.007975228 hartree
energy: -800.918439410873
