program: Gaussian 09
title: 000052829
version: EM64L-G09RevD.01
frameworkgroup: C1[X(C23H28FNO4)]
method: RPBEPBE
basis: SDD
operation: Freq
keyword: #p
keyword: freq=noraman
keyword: PBEPBE/SDD
title: #p freq=noraman PBEPBE/SDD
converged: YES YES NO NO
title: Mulliken charges:
elementType: F O O O O N C C C C C C C C C C C C C C C C C C C C C C C H H H H H H H H H H H H H H H H H H H H H H H H H H H H
charge: -0.195096 -0.428708 -0.429499 -0.288911 -0.221145 -0.057894 0.167694 -0.452091 -0.472076 -0.454405 -0.390898 -0.394862 0.304706 -0.347917 -0.405827 -0.011309 -0.386368 -0.537195 0.177665 -0.267127 -0.345360 0.135740 0.295239 -0.519096 -0.310024 -0.320869 -0.385387 -0.369067 0.334446 0.216561 0.218621 0.248654 0.171846 0.226962 0.185710 0.176044 0.208685 0.228073 0.172599 0.258198 0.159366 0.201925 0.237659 0.263679 0.350946 0.245019 0.227586 0.228106 0.255353 0.333346 0.229223 0.207857 0.261343 0.253833 0.284650 0.260496 0.263300
chargesum: 0.00000
title: Mulliken charges with hydrogens summed into heavy atoms:
elementType: F O O O O N C C C C C C C C C C C C C C C C C C C C C C C
charge: -0.195096 -0.077762 -0.096153 -0.288911 -0.221145 -0.057894 0.167694 -0.016909 -0.051577 -0.041733 -0.006170 0.005810 0.304706 0.069648 0.033756 -0.011309 -0.122689 -0.064589 0.177665 -0.039021 -0.090007 0.135740 0.295239 0.179327 -0.056191 -0.036219 -0.124891 -0.105767 0.334446
polarizability: 3.91028115e+02 -1.13149836e-01 2.57281518e+02 -2.95915310e+01 -9.86342920e+00 1.70292140e+02
1716.lowfreq: -12.8820 -3.9442 0.0004 0.0007 0.0010 1.7968 7.9613 14.0046 22.6246
frequency: 7.4024 13.4395 22.6009 28.1305 41.8343 55.5136 59.9982 70.4256 83.4813 86.9717 102.6394 112.2689 125.2013 135.3479 148.0113 167.8242 193.1327 196.7794 220.0233 236.7186 255.0305 261.8157 278.5115 283.9458 289.7708 301.5986 305.2561 319.9724 334.7643 358.1924 367.7173 376.6031 382.6749 404.0034 410.6462 413.2862 462.0215 474.4614 476.1075 480.3861 508.5242 537.4654 550.3675 561.7112 567.5339 580.2665 600.8875 618.1058 624.8887 661.9034 691.3652 723.4132 741.4779 752.8302 766.3446 793.8789 794.9634 803.0035 811.7227 816.8008 819.1086 839.8805 873.2761 882.0869 899.6187 917.8093 943.9200 954.8843 960.5941 965.7885 973.1030 977.1758 989.1580 994.5720 1004.8612 1009.6675 1024.4370 1031.8004 1056.5615 1069.6551 1079.4855 1095.8543 1106.1601 1110.0837 1117.7974 1124.3619 1131.3074 1147.2958 1151.2810 1153.8976 1156.9822 1173.2433 1185.4650 1190.6207 1198.8576 1202.0292 1206.4575 1219.2296 1239.2382 1251.0957 1268.7641 1274.6650 1279.0266 1292.1440 1299.8044 1305.2246 1316.4817 1321.0108 1328.7461 1338.7738 1345.8151 1355.0681 1369.6879 1372.3045 1376.2487 1380.5894 1396.8905 1410.7764 1426.3144 1430.2790 1431.6434 1440.8000 1452.0924 1453.8980 1456.6632 1464.9837 1468.2535 1477.5819 1482.3126 1484.8744 1491.5165 1492.4843 1573.7815 1586.4185 1601.1174 1603.1644 1613.8761 2811.4759 2822.2852 2846.5675 2932.7482 2951.5908 2961.1567 2972.6899 2996.9655 2999.9075 3013.4506 3028.1973 3031.9069 3043.4595 3048.3473 3065.1661 3074.0635 3083.4557 3087.0652 3126.4800 3142.4554 3154.6957 3158.2017 3169.4356 3178.1047 3181.1088 3186.1870 3521.0125 3579.4696
redmass: 5.6444 6.5254 4.2550 6.3350 4.3820 3.5685 4.6589 2.4215 3.8761 5.1790 5.9007 3.7796 4.0449 2.1097 2.4372 2.5787 2.2925 2.4686 2.0104 2.7286 2.3776 3.2936 3.3781 5.3620 3.1091 3.4711 5.9118 2.6795 2.6231 2.9157 3.9850 2.4222 1.7155 2.7540 2.9443 3.8174 3.9442 3.5723 3.3377 3.8361 3.1708 3.7641 3.6856 2.8145 4.3932 5.7580 4.1812 3.4917 7.1617 3.0406 2.4646 3.6335 2.5022 2.7927 3.2474 2.2753 3.1431 1.7174 4.9736 1.3573 2.0574 1.4896 2.3396 2.2657 1.4850 2.3610 2.5749 1.5483 2.6854 1.3466 3.1578 3.2324 1.3566 3.2380 2.6167 2.3864 1.9357 1.9372 2.2931 2.1964 2.1584 2.2824 1.3388 1.2359 2.4115 1.8491 2.9737 1.8363 1.8843 1.4698 1.4221 1.4169 1.1044 1.3951 2.1620 2.2474 1.7261 2.5804 1.7167 2.1307 1.7299 1.3796 1.3612 1.2775 1.3030 1.3034 1.2922 1.3286 1.4035 1.7713 1.3429 1.4253 5.5321 1.2731 1.4659 4.3994 1.4249 4.1396 1.2285 1.1087 1.8886 1.3107 1.1876 1.0928 1.0988 1.1863 1.6518 1.0842 1.0596 1.1199 2.5884 1.1005 7.9079 6.1451 7.1805 6.7798 7.2754 1.0720 1.0707 1.0707 1.0717 1.0671 1.0602 1.0356 1.0601 1.0697 1.0903 1.0852 1.0875 1.0924 1.0861 1.1030 1.1002 1.0959 1.0892 1.1048 1.0873 1.0887 1.0891 1.0941 1.0964 1.0974 1.0947 1.0654 1.0654
irintensity: 0.2940 0.1517 0.3015 0.8167 0.6745 2.1860 1.0691 5.4763 2.6893 1.5385 1.1871 3.9183 1.0816 14.6404 5.4263 0.9958 13.5585 12.1497 14.2265 21.6472 4.7408 6.5677 12.2344 0.5896 5.9697 7.1035 4.4879 4.7725 3.3181 28.6051 1.5422 27.3491 91.3610 5.3527 0.2195 15.2690 5.3510 5.9084 7.8402 13.6443 16.6841 12.7418 8.0359 11.9691 6.2900 10.8731 3.0138 1.7384 0.8637 7.2250 6.1298 0.0163 20.8066 24.5383 3.9496 20.3581 8.6063 10.5643 28.2223 24.4877 9.7082 57.6767 10.4166 2.1694 3.7936 11.6715 19.7017 6.7171 37.6836 0.5777 5.4144 131.2432 0.6915 38.0008 5.1695 1.2885 0.8111 25.6567 6.4664 30.3396 4.0301 14.2196 12.8486 5.7122 59.1485 73.4730 11.2138 35.6005 77.7039 5.7291 69.9562 2.4673 9.1199 41.8206 133.2598 27.0309 21.5991 117.7268 106.9994 55.5772 11.7635 2.4213 8.3261 2.2346 36.1506 11.4002 6.0711 19.1720 4.3605 60.0871 18.5987 7.3217 6.8376 17.5737 8.6915 27.0857 4.6139 15.7896 9.5163 32.7708 51.4924 15.8778 23.7774 7.2926 3.6793 12.6361 21.8419 5.8287 16.4913 4.1945 27.0503 14.6096 121.6599 22.2355 92.9585 5.9336 44.9568 43.9016 90.2166 162.5431 40.4988 113.3540 44.0513 89.4836 19.2222 17.9488 20.0929 49.9104 13.9728 26.1543 9.2121 18.7316 26.1446 36.8028 33.3466 18.4093 8.0695 7.0351 0.1066 10.2988 3.4884 4.5162 9.3571 7.9843 97.2885
temp: 298.150 k
press: 1.00000 atm
elementType: 9 8 8 8 8 7 6 6 6 6 6 6 6 6 6 6 6 6 6 6 6 6 6 6 6 6 6 6 6 1 1 1 1 1 1 1 1 1 1 1 1 1 1 1 1 1 1 1 1 1 1 1 1 1 1 1 1
symmnumber: 1
zpe: 1219667.0 jmol-1
zpe.correction: 0.464547 hartree
zpe.thermalcorrener: 0.493315 hartree
zpe.thermalcorrenthalpy: 0.494259 hartree
zpe.thermalcorrgfe: 0.401358 hartree
zpe.sumelectzpe: -1346.513843 hartree
zpe.sumelectthermal: -1346.485075 hartree
zpe.sumelectthermalent: -1346.484131 hartree
zpe.sumelectthermalfe: -1346.577032 hartree
dipole: -2.0109 -2.8174 0.5999
dipole: 3.5130
quadrupole: -185.3862 -159.9658 -186.0702
quadrupole: 8.7676 6.8232 -3.6650
quadrupole: -8.2455 17.1749 -8.9295 8.7676 6.8232 -3.6650
hfenergy: -1346.9783898 hartree
pointgroup: C01 [X(C23H28F1N1O4)]
dipole: 0.7925271 -1.0547138 -0.411972 debye
polarizability: 391.7902291|4.3208384|251.3663252|-26.2168101|24.1296215|175.4452184 unknown
InChI: InChI=1S/C23H28FNO4/c1-29-21-6-2-4-19(22(21)28)23(16-26)11-14-25(15-12-23)13-3-5-20(27)17-7-9-18(24)10-8-17/h2,4,6-10,26,28H,3,5,11-16H2,1H3
charge 0 multiplicity 1
57 atoms
F  10.14841 -0.337347 -0.460911
O  -3.784862 1.248763 -2.687263
O  -5.202555 -1.761958 -0.526903
O  -7.686218 -1.228101 0.646035
O  4.112539 1.240114 1.021254
N  0.02927 0.116809 0.034066
C  -2.942027 0.292093 -0.516116
C  -2.011158 1.518675 -0.253975
C  -2.227615 -0.941065 0.139896
C  -0.545605 1.289295 -0.66847
C  -0.749178 -1.099409 -0.2771
C  -3.106103 0.110999 -2.064757
C  -4.358632 0.519239 0.096149
C  1.483956 -0.043022 -0.203915
C  2.183262 -0.841954 0.918471
C  -5.380019 -0.484179 0.04926
C  -4.698571 1.751667 0.719482
C  3.668584 -1.128551 0.618657
C  -6.676546 -0.250371 0.598491
C  -5.969776 1.981268 1.285363
C  -6.959643 0.981368 1.223543
C  4.573752 0.107833 0.69017
C  6.036233 -0.050261 0.375165
C  -8.098216 -1.867975 -0.620826
C  6.612316 -1.299014 0.013319
C  6.870438 1.09997 0.449899
C  7.989694 -1.40424 -0.268339
C  8.247007 1.016383 0.171991
C  8.774114 -0.240232 -0.181684
H  -2.012164 1.744302 0.828535
H  -2.399502 2.399195 -0.798599
H  -2.275775 -0.812051 1.23696
H  -2.728181 -1.908108 -0.079383
H  0.042468 2.182807 -0.389506
H  -0.461018 1.184953 -1.781424
H  -0.681418 -1.35846 -1.368691
H  -0.322537 -1.954989 0.277327
H  -2.125178 0.070198 -2.562547
H  -3.643748 -0.833224 -2.305595
H  1.935958 0.963482 -0.241256
H  1.685315 -0.53344 -1.194203
H  1.666646 -1.808549 1.073448
H  2.092539 -0.266505 1.856719
H  -3.956046 2.549932 0.769804
H  -4.641338 1.397829 -2.207013
H  4.063149 -1.875176 1.338713
H  3.776325 -1.593384 -0.383876
H  -6.188808 2.941156 1.76404
H  -7.957612 1.12206 1.649479
H  -4.25999 -1.898934 -0.787629
H  -8.94088 -2.520012 -0.344297
H  -8.439289 -1.103155 -1.345929
H  -7.275338 -2.45854 -1.053673
H  5.992334 -2.198211 -0.050063
H  6.409146 2.051878 0.7315
H  8.452205 -2.355091 -0.547264
H  8.902685 1.890042 0.224573
