program: Orca
programVersion: 6.0.x
elementType: C N C H H O H H C H H C H H H C H H F
charge: 1
multiplicity: 1
keywords: wB97X-D3 def2-TZVPPD autoaux TightSCF
formula: C5H11FNO
InChI: InChI=1/C5H9FN.H2O/c1-2-5(7)3-4-6;/h2-4H2,1H3;1H2
19 atoms
C  0.497301 0.074503 0.069562
N  0.783231 1.187638 0.424356
C  -1.00837 0.452591 0.642951
H  -1.115195 -0.335602 1.395187
H  -1.117795 1.413121 1.15757
O  3.070503 1.080251 -0.179742
H  3.310119 1.739995 -0.839905
H  3.637261 1.254334 0.579897
C  0.887468 -1.224921 -0.535344
H  0.428021 -1.264821 -1.529067
H  1.970322 -1.144022 -0.665784
C  0.480783 -2.42921 0.318272
H  -0.604364 -2.529082 0.403151
H  0.857113 -3.332094 -0.165132
H  0.917874 -2.377236 1.317662
C  -1.962458 0.404188 -0.552295
H  -1.684857 1.149774 -1.302747
H  -2.007686 -0.592196 -1.000543
F  -3.200139 0.708595 -0.045061
totalener: -426.66836989114501 hartree
nucrepener: 381.76131786961707 hartree
electener: -808.42967376886827 hartree
oneelecener: -1326.92282220076800 hartree
twoeener: 518.49314843189973 hartree
kineticenergy: 424.75781415923950 hartree
xcener: -39.229814961163 hartree
energy: -678.5059 -527.9914 -400.5641 -287.9287 -286.9903 -286.8150 -285.7798 -284.2674 -40.2538 -35.7847 -35.1584 -30.0072 -29.3087 -25.9822 -25.5805 -22.8368 -21.8326 -21.7268 -21.2383 -20.8654 -20.4076 -20.0860 -19.4719 -19.1658 -18.5094 -17.9576 -17.6318 -17.5267 -17.1464 -16.7355 -16.6054 -15.7287 -5.7461 -3.6027 -1.9835 -1.5429 -1.3496 -1.1733 -0.9821 -0.6627 -0.3776 -0.0977 0.0664 electronvolt
chargesum: 1.0000000
charge: 0.248975 -0.217759 0.195764 0.197903 0.116286 -0.337176 0.176980 0.181537 0.313795 0.202579 0.224902 -0.886317 0.203229 0.223601 0.223405 -0.117397 0.201315 0.157606 -0.309227
charge: -0.182851 0.385319 0.145795 0.051873 0.048180 0.444504 -0.158184 -0.158143 0.037510 0.048399 0.031557 0.180684 -0.002036 0.009742 0.010417 -0.027556 0.054207 0.042806 0.037778
qa: 0.2490 -0.2178 0.1958 0.1979 0.1163 -0.3372 0.1770 0.1815 0.3138 0.2026 0.2249 -0.8863 0.2032 0.2236 0.2234 -0.1174 0.2013 0.1576 -0.3092
va: 3.5813 2.2952 3.6019 0.9512 1.0885 2.1121 1.0493 1.0444 3.1279 0.9405 0.9748 3.8664 1.0135 1.0702 1.0359 3.6913 0.9882 1.0452 0.8648
dispcorr: -0.005970923 hartree
energy: -426.674340814076
