program: Orca
programVersion: 6.0.x
elementType: C N C H H O H H C H H C F F F C H H H
charge: 1
multiplicity: 1
keywords: wB97X-D3 def2-TZVPPD autoaux TightSCF
formula: C5H9F3NO
InChI: InChI=1/C5H7F3N.H2O/c1-2-4(9)3-5(6,7)8;/h2-3H2,1H3;1H2
19 atoms
C  -0.184352 0.935053 -0.028358
N  -0.183649 2.069251 0.365729
C  -1.76362 0.842025 0.517775
H  -1.625246 0.023075 1.230721
H  -2.077507 1.719351 1.09153
O  2.016916 2.588927 -0.177937
H  2.067078 3.366077 -0.746075
H  2.506569 2.815852 0.621164
C  0.583088 -0.129585 -0.71858
H  0.142815 -0.306575 -1.703965
H  1.599639 0.255993 -0.833914
C  0.599229 -1.438192 0.072212
F  1.438021 -2.293195 -0.494245
F  -0.626004 -1.992017 0.105348
F  0.978802 -1.217331 1.338495
C  -2.645136 0.592897 -0.685793
H  -2.655745 1.44926 -1.363469
H  -2.367885 -0.312276 -1.227375
H  -3.662215 0.460172 -0.302654
totalener: -625.20833250933765 hartree
nucrepener: 591.69759032757088 hartree
electener: -1216.90592694042266 hartree
oneelecener: -2020.45303847709556 hartree
twoeener: 803.54711153667290 hartree
kineticenergy: 622.72537473310888 hartree
xcener: -53.816290409413 hartree
energy: -679.6821 -679.6497 -679.5943 -528.2516 -400.6949 -291.2282 -288.0586 -287.0013 -286.3374 -284.5991 -43.4207 -40.9675 -40.9181 -35.8219 -35.3416 -30.4570 -29.5658 -26.3308 -25.6329 -23.9448 -23.5702 -23.3205 -22.3591 -22.0096 -21.5151 -20.6246 -20.2390 -19.8331 -19.8117 -19.6721 -19.2815 -18.7703 -18.6978 -18.3475 -18.3103 -18.0936 -17.6668 -17.5008 -17.3680 -15.9406 -6.0284 -3.7792 -2.0158 -1.5515 -1.2375 -0.9319 -0.9134 -0.6407 -0.3589 -0.0361 -0.0012 electronvolt
chargesum: 1.0000000
charge: 0.306149 -0.256759 0.344229 0.199255 0.148219 -0.331387 0.171639 0.188978 -0.041815 0.211178 0.203967 0.895566 -0.283488 -0.282405 -0.287760 -0.848543 0.219531 0.229515 0.213932
charge: -0.171482 0.391914 0.109959 0.042738 0.038602 0.447858 -0.152779 -0.151176 0.170723 0.067839 0.048879 -0.590624 0.192836 0.155546 0.168386 0.190428 0.018301 0.000186 0.021863
qa: 0.3061 -0.2568 0.3442 0.1993 0.1482 -0.3314 0.1716 0.1890 -0.0418 0.2112 0.2040 0.8956 -0.2835 -0.2824 -0.2878 -0.8485 0.2195 0.2295 0.2139
va: 3.4331 2.1820 3.2505 1.0019 1.0567 2.1280 1.0537 1.0421 4.1041 0.9365 1.0237 3.2036 0.8848 0.9278 0.8879 3.9077 1.0460 0.9834 1.0541
dispcorr: -0.006865579 hartree
energy: -625.215198088785
