program: Gaussian 09
title: 000052736
version: EM64L-G09RevD.01
frameworkgroup: C1[X(C16H12N2OS2)]
method: RPBEPBE
basis: SDD
operation: Freq
keyword: #p
keyword: freq=noraman
keyword: PBEPBE/SDD
title: #p freq=noraman PBEPBE/SDD
converged: YES YES NO NO
title: Mulliken charges:
elementType: S S O N N C C C C C C C C C C C C C C C C H H H H H H H H H H H H
charge: 0.287348 0.287296 -0.296564 0.014316 0.014283 0.475805 0.475821 0.336203 0.336102 -0.337107 -0.337106 -0.345090 -0.345144 -0.374525 -0.374504 -0.351445 -0.351395 -0.809329 -0.809322 -0.364732 -0.364750 0.245790 0.245768 0.244483 0.244449 0.264705 0.264667 0.272705 0.272650 0.294850 0.294478 0.294836 0.294458
chargesum: 0.00000
title: Mulliken charges with hydrogens summed into heavy atoms:
elementType: S S O N N C C C C C C C C C C C C C C C C
charge: 0.287348 0.287296 -0.296564 0.014316 0.014283 0.475805 0.475821 0.336203 0.336102 -0.091317 -0.091338 -0.100608 -0.100695 -0.109820 -0.109837 -0.078740 -0.078745 -0.220001 -0.220028 -0.364732 -0.364750
polarizability: 4.25872296e+02 -1.55388619e-03 2.01531151e+02 3.35565721e-01 -2.20404933e-02 1.32321051e+02
1716.lowfreq: -2.7693 -0.8018 -0.0014 -0.0006 0.0018 8.8346 12.3238 21.5388 21.9834
frequency: 12.3177 21.1582 21.8602 27.6304 34.4532 48.7154 59.3294 64.5487 81.7769 116.5995 121.5295 157.6167 179.1169 256.3480 266.1023 329.6990 339.1152 348.7788 379.9594 380.3982 390.0884 401.2528 405.2740 409.6027 413.7026 482.7155 497.2533 510.7849 565.2823 598.7561 608.4214 629.1852 630.7153 642.0544 647.1235 689.3680 730.6968 755.3572 786.6771 816.1040 828.8624 837.6915 846.3839 859.2476 859.6687 889.6686 890.4673 955.4117 960.9342 969.2971 974.4461 1005.2114 1005.8657 1091.3261 1093.3785 1132.7986 1133.8443 1156.3585 1176.6098 1195.8305 1217.2954 1225.7327 1233.6440 1235.4689 1235.5106 1300.8998 1309.0807 1376.1968 1389.0308 1416.5096 1420.4641 1457.7463 1457.8795 1490.6747 1498.4719 1580.8932 1591.1963 1607.9396 1622.7045 2094.3919 2094.4910 3056.1500 3056.1885 3134.7915 3135.1954 3138.6474 3138.8939 3140.1517 3140.1929 3165.3032 3167.6078 3174.8512 3175.1809
redmass: 11.8401 8.1220 5.8811 13.9128 6.8485 5.1546 8.8889 4.2087 6.2748 10.5395 9.3004 7.3823 8.4195 4.3165 3.8162 4.4030 2.8276 7.2541 11.9781 12.3446 4.2342 9.8897 8.8530 2.9398 2.9919 3.8597 3.4377 7.3883 6.7543 5.5845 5.1469 6.8788 7.0838 9.1010 6.4348 4.9672 3.8859 4.5636 3.7951 4.0074 1.2949 1.2538 1.7138 1.8509 5.9220 1.4837 1.4823 1.3504 1.3422 1.3642 1.3521 2.7516 2.8712 1.2403 1.2224 1.1163 1.1260 2.1385 1.2342 1.3988 1.7770 1.6727 1.6566 2.6989 2.0416 1.3118 1.2773 4.9709 6.5887 3.5391 3.3194 1.1240 1.1248 2.5891 2.6673 7.0652 7.3049 6.2976 6.5111 12.7174 12.7183 1.0574 1.0574 1.0910 1.0916 1.0941 1.0941 1.1055 1.1052 1.0957 1.0951 1.0959 1.0961
irintensity: 2.5538 1.2134 3.8558 1.2406 0.0005 0.1640 4.7575 1.2086 1.8040 3.3508 1.2752 0.0280 14.8711 2.4910 4.3348 2.1320 0.0312 7.2503 0.3510 0.2815 1.4080 13.0704 6.4213 1.2631 0.1695 9.6470 52.5367 72.5501 23.9556 37.3161 13.9961 0.0025 0.6009 3.9693 3.7222 1.1834 21.2442 2.5073 8.6240 0.0794 3.8083 0.6102 81.7762 30.2319 65.1594 0.6666 0.5647 0.1094 0.2597 0.7039 0.0010 22.1363 0.2862 4.3077 6.5760 4.4099 12.1916 7.9780 188.1055 0.7685 273.3340 0.2116 149.0722 345.9070 153.9262 2.1323 1.0383 2.5107 0.0007 4.8491 3.5844 5.1247 1.6358 345.5679 9.0035 3.0155 5.9482 276.6368 6.5009 75.6839 16.0719 14.6913 3.7813 5.4960 5.7696 21.0266 1.1087 8.8152 5.4908 8.0870 1.5217 1.0051 3.6011
temp: 298.150 k
press: 1.00000 atm
elementType: 16 16 8 7 7 6 6 6 6 6 6 6 6 6 6 6 6 6 6 6 6 1 1 1 1 1 1 1 1 1 1 1 1
symmnumber: 1
zpe: 617274.0 jmol-1
zpe.correction: 0.235107 hartree
zpe.thermalcorrener: 0.255697 hartree
zpe.thermalcorrenthalpy: 0.256642 hartree
zpe.thermalcorrgfe: 0.179472 hartree
zpe.sumelectzpe: -1596.224289 hartree
zpe.sumelectthermal: -1596.203699 hartree
zpe.sumelectthermalent: -1596.202755 hartree
zpe.sumelectthermalfe: -1596.279924 hartree
dipole: -0.0086 4.7715 -0.0014
dipole: 4.7715
quadrupole: -226.5426 -143.9234 -134.1936
quadrupole: -0.0026 -5.0780 -0.0135
quadrupole: -58.3227 24.2965 34.0263 -0.0026 -5.0780 -0.0135
hfenergy: -1596.4593965 hartree
pointgroup: C01 [X(C16H12N2O1S2)]
dipole: -0.0032537 1.8772484 0.0003292 debye
polarizability: 425.6128004|-0.018422|201.5311572|8.7304147|0.0131577|132.5805415 unknown
InChI: InChI=1S/C16H12N2OS2/c17-11-20-9-13-1-5-15(6-2-13)19-16-7-3-14(4-8-16)10-21-12-18/h1-8H,9-10H2
charge 0 multiplicity 1
33 atoms
S  -5.480097 -1.493164 -0.876419
S  5.480366 -1.493281 0.875719
O  -0.000046 2.178567 0.002268
N  -8.156715 -2.475547 -0.154018
N  8.15612 -2.476394 0.151122
C  -3.790866 0.334523 0.46552
C  3.789526 0.333239 -0.465815
C  -1.228171 1.487666 0.13227
C  1.227421 1.48736 -0.129738
C  -3.63323 1.560399 -0.235033
C  3.633218 1.560034 0.233476
C  -2.636317 -0.29779 0.998402
C  2.633945 -0.299411 -0.996009
C  -2.361238 2.140571 -0.401878
C  2.361653 2.140627 0.401682
C  -1.356225 0.269755 0.841626
C  1.354205 0.268543 -0.8378
C  -5.148348 -0.279416 0.637224
C  5.146563 -0.281214 -0.638882
C  -7.064504 -2.064277 -0.434449
C  7.064237 -2.064844 0.432429
H  -4.513274 2.062027 -0.653376
H  4.514019 2.062031 0.649787
H  -2.740453 -1.239282 1.550074
H  2.736928 -1.241611 -1.5467
H  -2.227869 3.08742 -0.932518
H  2.229372 3.088141 0.931424
H  -0.477668 -0.215745 1.276696
H  0.474961 -0.217457 -1.270921
H  -5.233455 -0.911944 1.532768
H  -5.96738 0.453539 0.601031
H  5.230184 -0.914839 -1.533789
H  5.965838 0.451574 -0.604772
