program: Orca
programVersion: 6.0.x
elementType: C N C H H O H H C H H C C H H H C H H H
charge: 1
multiplicity: 1
keywords: wB97X-D3 def2-TZVPPD autoaux TightSCF
formula: C6H12NO
InChI: InChI=1/C6H10N.H2O/c1-3-5-6(7)4-2;/h3H,1,4-5H2,2H3;1H2
20 atoms
C  -0.191647 0.49179 0.059366
N  -0.619359 1.55828 0.420007
C  -1.545417 -0.256906 0.628124
H  -1.040236 -0.964749 1.296436
H  -2.179549 0.388802 1.239922
O  1.09778 2.909959 -0.190466
H  0.770575 3.573517 -0.80877
H  1.380603 3.396275 0.592644
C  0.940062 -0.250268 -0.580429
H  0.56891 -0.638716 -1.534311
H  1.699353 0.51147 -0.780166
C  1.441296 -1.35713 0.310223
C  1.313311 -2.647853 0.009564
H  1.95088 -1.049166 1.220132
H  1.713676 -3.414421 0.664137
H  0.832592 -2.984044 -0.905905
C  -2.284344 -0.850949 -0.5514
H  -2.673404 -0.075191 -1.214372
H  -1.665753 -1.545629 -1.121893
H  -3.138017 -1.405709 -0.150125
totalener: -365.50617882802834 hartree
nucrepener: 366.09549116024158 hartree
electener: -731.60164518380202 hartree
oneelecener: -1208.45807446501863 hartree
twoeener: 476.85642928121661 hartree
kineticenergy: 363.69707957654066 hartree
xcener: -35.681485731224 hartree
energy: -528.1446 -400.1345 -287.3240 -286.4144 -285.4700 -284.2470 -284.2386 -283.8238 -35.4555 -34.9032 -29.9376 -29.1231 -27.2096 -25.2472 -22.9704 -22.1016 -21.8696 -21.1173 -20.3715 -19.6666 -19.4174 -19.1320 -18.7330 -18.2413 -17.5321 -17.3981 -17.2640 -17.0892 -16.3601 -15.7454 -14.1346 -5.7252 -3.2867 -1.8410 -1.7357 -1.3189 -1.1905 -0.7618 -0.4887 -0.4179 -0.3359 -0.1216 electronvolt
chargesum: 1.0000000
charge: 0.375519 -0.276819 0.294085 0.215451 0.159765 -0.334149 0.186569 0.190953 0.355412 0.172528 0.215256 -0.519298 -0.298747 0.187179 0.161272 0.129768 -0.835427 0.211615 0.200427 0.208641
charge: -0.203579 0.382106 0.090720 0.039921 0.033513 0.449323 -0.151210 -0.151441 0.048892 0.044960 0.032708 -0.039561 0.220739 0.018367 -0.015132 -0.014738 0.185165 0.016218 -0.004188 0.017218
qa: 0.3755 -0.2768 0.2941 0.2155 0.1598 -0.3341 0.1866 0.1910 0.3554 0.1725 0.2153 -0.5193 -0.2987 0.1872 0.1613 0.1298 -0.8354 0.2116 0.2004 0.2086
va: 3.3662 2.1747 3.3435 0.9509 1.0367 2.1278 1.0377 1.0352 3.0427 0.9318 0.9956 3.4610 3.7382 0.9808 0.9906 0.9742 3.9548 1.0508 1.0077 1.0656
dispcorr: -0.006424434 hartree
energy: -365.512603262046
