program: Orca
programVersion: 6.0.x
elementType: C N C H H O H H O H H C H H C C H H H C H H H
charge: 1
multiplicity: 1
keywords: wB97X-D3 def2-TZVPPD autoaux TightSCF
formula: C6H14NO2
InChI: InChI=1/C6H10N.2H2O/c1-3-5-6(7)4-2;;/h3H,1,4-5H2,2H3;2*1H2
23 atoms
C  -0.25054 0.3145 -0.225601
N  0.558521 0.955893 -0.8269
C  -1.226214 0.612205 -1.590747
H  -2.067078 0.998453 -1.00199
H  -0.887343 1.410327 -2.252748
O  2.178517 0.747333 0.961041
H  2.952813 0.232034 0.657076
H  2.522144 1.594228 1.259559
O  4.289631 -0.796213 0.102749
H  4.881817 -0.579259 -0.622976
H  4.792012 -1.345685 0.711398
C  -0.717882 -0.458138 0.954773
H  -0.853914 -1.496279 0.635813
H  0.128752 -0.407531 1.64802
C  -1.98572 0.121104 1.529434
C  -3.157164 -0.509815 1.487332
H  -1.892972 1.089437 2.014992
H  -4.042245 -0.073086 1.93698
H  -3.269581 -1.489453 1.029123
C  -1.426747 -0.705519 -2.297177
H  -0.506804 -1.044537 -2.777424
H  -1.803336 -1.484649 -1.632242
H  -2.173901 -0.540049 -3.080205
totalener: -441.96946012968829 hartree
nucrepener: 442.28677106942666 hartree
electener: -884.25621659499745 hartree
oneelecener: -1465.05362674176945 hartree
twoeener: 580.79741014677199 hartree
kineticenergy: 439.85272690857522 hartree
xcener: -42.178887687237 hartree
energy: -527.0660 -526.6168 -399.6345 -287.1793 -286.4816 -285.2601 -284.1360 -284.0878 -283.6661 -34.9081 -34.4056 -33.7784 -29.7747 -28.9635 -27.0911 -25.0580 -22.8104 -21.9218 -20.9666 -20.9052 -20.6563 -20.1590 -19.4578 -19.1602 -18.9063 -18.5744 -17.8573 -17.3946 -17.2080 -17.1706 -16.8948 -16.3292 -16.1762 -15.0308 -14.6057 -13.9670 -4.8532 -3.0024 -1.6098 -1.5448 -1.1932 -1.0321 -0.7015 -0.5562 -0.4557 -0.2611 -0.0564 electronvolt
chargesum: 1.0000000
charge: 0.261703 -0.251726 0.319491 0.225516 0.165919 -0.455712 0.323003 0.137981 -0.352522 0.182412 0.183772 0.453949 0.165989 0.216882 -0.536386 -0.305063 0.185300 0.164539 0.134574 -0.856156 0.211076 0.217186 0.208274
charge: -0.181352 0.373880 0.106185 0.036351 0.033332 0.418154 -0.256714 -0.171179 0.469703 -0.167031 -0.166052 0.047026 0.045187 0.032841 -0.037873 0.217111 0.018828 -0.016329 -0.015342 0.182249 0.015730 -0.002381 0.017678
qa: 0.2617 -0.2517 0.3195 0.2255 0.1659 -0.4557 0.3230 0.1380 -0.3525 0.1824 0.1838 0.4539 0.1660 0.2169 -0.5364 -0.3051 0.1853 0.1645 0.1346 -0.8562 0.2111 0.2172 0.2083
va: 3.4173 2.2495 3.2888 0.9418 1.0391 2.0618 0.9161 1.0810 2.0268 1.0214 1.0218 2.8564 0.9291 0.9873 3.4457 3.7393 0.9922 0.9876 0.9743 3.9791 1.0493 0.9933 1.0627
dispcorr: -0.007197335 hartree
energy: -441.976657464617
