program: Orca
programVersion: 6.0.x
elementType: C N C H H H O H H C H H C F F F
charge: 1
multiplicity: 1
keywords: wB97X-D3 def2-TZVPPD autoaux TightSCF
formula: C4H7F3NO
InChI: InChI=1/C4H5F3N.H2O/c1-3(8)2-4(5,6)7;/h2H2,1H3;1H2
16 atoms
C  -0.548668 0.986882 -0.211916
N  -0.7755 2.102995 0.160279
C  -2.178361 0.807676 0.102131
H  -2.542609 0.508123 -0.881603
H  -2.160491 0.046383 0.882267
H  -2.746385 1.675075 0.45085
O  1.560306 2.772984 -0.069364
H  1.734305 3.479787 -0.700582
H  1.937902 3.072851 0.764979
C  0.390129 -0.02377 -0.744645
H  0.206505 -0.141841 -1.817419
H  1.390794 0.389895 -0.587515
C  0.243842 -1.380644 -0.053101
F  1.205403 -2.194795 -0.458021
F  -0.946506 -1.9323 -0.342214
F  0.313391 -1.235386 1.278073
totalener: -585.88182352776096 hartree
nucrepener: 495.33391096593988 hartree
electener: -1081.21575334853924 hartree
oneelecener: -1776.77512017126264 hartree
twoeener: 695.55936682272340 hartree
kineticenergy: 583.62847697444693 hartree
xcener: -49.642900886150 hartree
energy: -679.8391 -679.8264 -679.7625 -528.0872 -401.0574 -291.4198 -288.6409 -287.3188 -286.6146 -43.5964 -41.1460 -41.0894 -36.3511 -35.3037 -30.7663 -28.5966 -26.5535 -24.1932 -23.7428 -23.5583 -22.6377 -21.9333 -21.7697 -20.9836 -20.5564 -20.3903 -20.0125 -19.8450 -19.3004 -18.9485 -18.8905 -18.4754 -18.3786 -18.0647 -17.6989 -15.9613 -5.9545 -4.1001 -2.2169 -1.8840 -1.5118 -1.0982 -0.9524 -0.4159 -0.3365 -0.1167 0.1115 electronvolt
chargesum: 1.0000000
charge: 0.415610 -0.166331 -0.334247 0.212285 0.200598 0.174454 -0.331495 0.167212 0.175362 -0.005047 0.223105 0.189338 0.912551 -0.269754 -0.282147 -0.281493
charge: -0.161703 0.376560 0.338337 0.038842 0.027374 0.030890 0.441457 -0.159020 -0.157900 0.172673 0.075510 0.050203 -0.595640 0.196357 0.158337 0.167723
qa: 0.4156 -0.1663 -0.3342 0.2123 0.2006 0.1745 -0.3315 0.1672 0.1754 -0.0050 0.2231 0.1893 0.9126 -0.2698 -0.2821 -0.2815
va: 3.2083 2.2431 3.7825 0.9940 1.0331 1.0425 2.1210 1.0622 1.0546 4.0396 0.9578 1.0447 3.2418 0.9067 0.9399 0.9012
dispcorr: -0.005171535 hartree
energy: -585.886995062810
