program: Orca
programVersion: 6.0.x
elementType: C N C H H H O H H O H H C C C C H C H C H H O C H H H
charge: 1
multiplicity: 1
keywords: wB97X-D3 def2-TZVPPD autoaux TightSCF
formula: C9H14NO3
InChI: InChI=1/C9H10NO.2H2O/c1-7(10)8-3-5-9(11-2)6-4-8;;/h3-6H,1-2H3;2*1H2
27 atoms
C  1.43998 0.173532 -1.289285
N  2.631327 0.371914 -1.246222
C  1.939444 -0.118503 -2.88365
H  1.635224 -1.159499 -2.990587
H  1.33677 0.625313 -3.40482
H  2.980524 -0.014213 -3.191156
O  2.804077 0.95516 1.196236
H  3.395349 0.299513 1.613894
H  3.235872 1.80715 1.303581
O  4.427059 -0.948794 2.388311
H  5.303206 -1.21158 2.093127
H  4.375492 -1.165083 3.323534
C  0.097064 0.069262 -0.836795
C  -0.951838 -0.306306 -1.704395
C  -0.164507 0.355587 0.51735
C  -2.234033 -0.392692 -1.222073
H  -0.76448 -0.527572 -2.749819
C  -1.45723 0.268941 0.997636
H  0.657582 0.642212 1.166334
C  -2.502198 -0.10579 0.133731
H  -3.059267 -0.678419 -1.863513
H  -1.647288 0.491373 2.039804
O  -3.773844 -0.217912 0.497318
C  -4.155848 0.063845 1.843759
H  -3.935226 1.105325 2.096146
H  -5.230154 -0.102574 1.880869
H  -3.653975 -0.615979 2.538547
totalener: -631.54264627489215 hartree
nucrepener: 757.64314992354218 hartree
electener: -1389.18580790143255 hartree
oneelecener: -2348.07343520149516 hartree
twoeener: 958.88762730006260 hartree
kineticenergy: 628.62091912015285 hartree
xcener: -59.602116641983 hartree
energy: -527.9090 -526.8280 -526.2200 -399.0649 -287.0868 -286.2021 -285.6050 -284.6257 -284.2455 -284.1472 -284.0704 -283.5188 -283.4924 -36.1042 -34.7136 -34.1603 -33.4449 -30.7674 -28.2387 -27.7674 -27.2012 -26.0879 -24.0461 -23.5225 -22.0806 -20.9075 -20.7414 -20.4345 -20.3636 -20.2600 -19.7773 -19.1969 -19.0856 -18.6603 -18.2890 -17.9310 -17.6477 -17.3004 -17.2766 -17.1488 -16.6298 -16.3070 -15.9031 -15.2065 -15.0047 -14.7755 -14.2266 -13.3911 -12.3051 -3.8114 -3.6698 -2.1471 -1.5069 -1.1722 -0.9089 -0.6985 -0.4262 -0.3949 -0.2369 -0.0818 electronvolt
chargesum: 1.0000000
charge: 1.063185 -0.211481 -0.408169 0.209053 0.209052 0.183180 -0.458428 0.317147 0.126575 -0.345918 0.176239 0.175944 0.320394 -0.642947 -1.011729 -0.253449 0.038689 0.329672 0.353933 0.959246 0.121520 0.085076 -0.461922 -0.476502 0.232983 0.140972 0.227682
charge: -0.163537 0.315613 0.300976 0.027793 0.027999 0.021916 0.413660 -0.256618 -0.174921 0.467017 -0.170017 -0.169051 -0.144495 0.077958 0.111789 0.115604 0.021234 0.109377 -0.000972 -0.212702 0.034279 0.015334 0.008011 0.163418 0.020220 0.020943 0.019174
qa: 1.0632 -0.2115 -0.4082 0.2091 0.2091 0.1832 -0.4584 0.3171 0.1266 -0.3459 0.1762 0.1759 0.3204 -0.6429 -1.0117 -0.2534 0.0387 0.3297 0.3539 0.9592 0.1215 0.0851 -0.4619 -0.4765 0.2330 0.1410 0.2277
va: 1.6628 2.1521 3.8708 0.9816 0.9734 1.0470 2.1128 0.9349 1.1136 2.0171 1.0222 1.0252 1.2455 2.7595 2.9385 3.6049 0.9605 2.5638 0.5439 2.5368 0.9980 0.9208 1.6256 3.8049 0.9542 1.0554 0.9540
dispcorr: -0.008609611 hartree
energy: -631.551255886154
