program: Gaussian 09
title: 000052817
version: EM64L-G09RevD.01
frameworkgroup: C1[X(C21H19N3O2)]
method: RPBEPBE
basis: SDD
operation: Freq
keyword: #p
keyword: freq=noraman
keyword: PBEPBE/SDD
title: #p freq=noraman PBEPBE/SDD
converged: YES YES NO NO
title: Mulliken charges:
elementType: O O N N N C C C C C C C C C C C C C C C C C C C C C H H H H H H H H H H H H H H H H H H H
charge: -0.204990 -0.208606 -0.251684 -0.267980 0.015870 -0.255559 -0.434795 -0.407299 0.638784 0.412317 0.417101 -0.575179 -0.351397 -0.379301 -0.376223 -0.315492 -0.345874 0.379256 -0.199249 -0.382208 -0.230544 -0.229799 -0.231411 -0.236071 -0.264255 -0.264199 0.270301 0.246288 0.220294 0.229311 0.237824 0.287845 0.243661 0.234625 0.237372 0.218258 0.243047 0.237282 0.288801 0.221765 0.221564 0.228055 0.224583 0.229116 0.228795
chargesum: 0.00000
title: Mulliken charges with hydrogens summed into heavy atoms:
elementType: O O N N N C C C C C C C C C C C C C C C C C C C C C
charge: -0.204990 -0.208606 -0.251684 -0.267980 0.015870 0.014742 0.031786 0.059836 0.638784 0.412317 0.417101 -0.287334 -0.107736 -0.144676 -0.138851 -0.097234 -0.102827 0.379256 0.038034 -0.093407 -0.008779 -0.008235 -0.003356 -0.011488 -0.035139 -0.035404
polarizability: 3.14375194e+02 -1.27608109e+00 2.79326575e+02 9.55991257e+00 -3.15489133e+01 2.02623514e+02
1716.lowfreq: -9.7291 -5.3753 -0.0002 0.0005 0.0006 4.2130 12.0744 23.7601 33.2378
frequency: 11.4610 23.7303 33.2110 49.6971 56.7119 58.7727 74.9430 107.7129 114.7365 140.6010 166.0146 173.9546 183.8382 199.4044 233.3579 248.7313 284.5905 291.2880 309.2551 389.7285 401.4979 410.3985 411.2541 425.6688 433.7871 482.5983 505.6575 508.8825 520.0641 584.1239 613.0024 614.4014 620.8277 648.3477 651.1449 671.1932 689.0946 690.2165 695.6558 703.3621 753.3389 754.3116 768.6470 781.1569 809.6359 811.3861 821.8137 840.5300 869.0927 869.8684 895.7796 909.5142 935.5438 952.4886 955.8793 957.4219 969.9601 975.4900 978.4832 979.1774 983.0039 989.4941 990.5753 999.7017 1027.9095 1031.6327 1036.4071 1084.4489 1085.8515 1088.7215 1091.7187 1099.7528 1170.7348 1171.6704 1173.1893 1174.7020 1179.0305 1193.4719 1197.6125 1200.3756 1200.8621 1219.3781 1232.6612 1277.9572 1295.8039 1325.4515 1329.5877 1331.1233 1337.5858 1348.2123 1359.6811 1369.9078 1375.7531 1383.2712 1389.6422 1410.6535 1437.6367 1448.7182 1451.5002 1473.8884 1488.7346 1498.2294 1501.3671 1506.2060 1580.0131 1581.8998 1591.5841 1613.1228 1618.6059 1624.0721 2904.8988 2925.1452 2946.2898 3016.0004 3039.3802 3125.7492 3125.9223 3133.2781 3133.5945 3143.3505 3151.6444 3152.6286 3153.0303 3161.6252 3161.9224 3162.6763 3172.8288 3173.0080 3187.0551
redmass: 6.7548 5.6242 5.9699 3.7979 4.1883 8.7178 5.5005 3.3253 4.1534 6.9103 4.1392 4.4537 2.4199 4.6846 4.4768 5.9666 5.7534 6.2215 5.2857 8.0980 4.5757 2.9356 2.9222 3.3457 4.9078 4.4673 3.0171 2.8900 6.3469 4.9863 6.4154 6.4400 6.5404 6.4208 4.7749 7.7918 1.9330 1.8115 2.0869 5.5678 1.8684 1.9008 6.8350 2.5654 1.2646 1.3092 1.6592 4.8171 1.4873 1.4873 5.4663 1.5748 1.5494 1.4036 1.3810 1.3799 5.2795 2.6849 1.4046 1.5994 4.9896 3.3640 5.7657 1.3725 2.3420 2.0485 2.0226 1.6881 1.7319 1.7108 1.6445 1.5921 1.5443 1.2047 1.1217 1.6382 1.8554 1.5404 1.2787 1.6803 1.3820 6.4634 1.5177 1.3609 1.3211 1.4135 1.6529 1.3680 1.4483 1.4976 2.3607 9.9637 3.2376 5.5246 5.1666 5.1235 2.5277 2.5682 2.5686 2.5832 1.4715 1.5425 1.5351 1.7012 6.0934 6.1607 6.4751 7.1119 6.1647 6.1406 1.0843 1.0714 1.0641 1.0968 1.0944 1.0848 1.0847 1.0885 1.0883 1.0873 1.0915 1.0924 1.0923 1.0944 1.0945 1.0944 1.0993 1.0992 1.0963
irintensity: 0.8072 0.0695 0.2011 0.1474 0.6244 0.6472 0.1793 3.0026 0.5727 8.8944 0.2418 0.6577 1.4371 1.4762 0.4811 0.3205 11.9934 0.1641 2.7897 2.7869 0.0975 0.6759 0.1460 0.4128 3.2426 3.4959 3.1805 21.8207 0.6808 8.6767 1.9043 0.1395 11.8103 1.7249 2.0484 20.4745 63.5923 6.4768 49.9161 14.1719 6.0613 149.5751 27.6444 3.4155 0.1971 4.3302 24.2277 22.1618 1.6896 13.8832 1.1240 16.1207 3.9667 9.5843 0.7628 1.9621 0.4452 0.5185 2.3743 0.3534 1.3533 30.8502 1.4839 1.5296 1.3042 28.9708 3.3735 14.6716 15.9348 6.4420 26.4183 2.2619 13.1846 7.1206 14.4045 10.3183 1.0694 30.3284 26.6915 95.2933 51.3606 242.0873 38.8757 13.7489 20.2492 9.2273 81.4553 2.8569 15.5966 13.3453 263.6398 119.7983 34.4855 5.2252 6.1911 1.1447 21.8137 0.1111 0.7734 17.1919 266.1135 103.5180 32.4949 11.4235 5.4684 15.5898 7.5882 3.3944 309.9628 31.0775 26.1741 61.9925 59.4148 37.6455 34.8089 14.1914 4.5607 5.8108 6.2042 5.0361 13.5773 27.4869 27.7720 46.0720 24.6653 17.8910 4.5179 3.5984 3.4353
temp: 298.150 k
press: 1.00000 atm
elementType: 8 8 7 7 7 6 6 6 6 6 6 6 6 6 6 6 6 6 6 6 6 6 6 6 6 6 1 1 1 1 1 1 1 1 1 1 1 1 1 1 1 1 1 1 1
symmnumber: 1
zpe: 930488.8 jmol-1
zpe.correction: 0.354404 hartree
zpe.thermalcorrener: 0.376026 hartree
zpe.thermalcorrenthalpy: 0.376970 hartree
zpe.thermalcorrgfe: 0.300777 hartree
zpe.sumelectzpe: -1124.417850 hartree
zpe.sumelectthermal: -1124.396229 hartree
zpe.sumelectthermalent: -1124.395285 hartree
zpe.sumelectthermalfe: -1124.471477 hartree
dipole: 2.0389 -5.1793 3.6661
dipole: 6.6650
quadrupole: -153.1714 -163.9178 -145.1879
quadrupole: 7.0023 -1.0008 -2.2391
quadrupole: 0.9210 -9.8254 8.9045 7.0023 -1.0008 -2.2391
hfenergy: -1124.7722546 hartree
pointgroup: C01 [X(C21H19N3O2)]
dipole: 0.2639764 -2.1172598 1.5243334 debye
polarizability: 311.6522656|-8.7396805|279.4721548|3.5816027|-35.8501135|205.2008621 unknown
InChI: InChI=1S/C21H19N3O2/c25-24(26)20-13-7-8-17(16-20)21-22(18-9-3-1-4-10-18)14-15-23(21)19-11-5-2-6-12-19/h1-13,16,21H,14-15H2
charge 0 multiplicity 1
45 atoms
O  -0.719323 5.293924 0.05133
O  -0.684167 3.971718 -1.806407
N  -1.036108 -1.707812 0.190513
N  1.258406 -1.622368 0.357747
N  -0.601016 4.146475 -0.528573
C  0.11349 -0.842141 -0.150687
C  -0.671918 -2.720097 1.192105
C  0.843854 -2.898362 0.971573
C  0.013947 0.556425 0.496237
C  -2.358441 -1.464006 -0.21289
C  2.574906 -1.4041 -0.083854
C  -0.22427 1.695138 -0.298974
C  0.134289 0.709331 1.900734
C  -3.443726 -2.121234 0.441252
C  3.608269 -2.331215 0.248297
C  -2.658548 -0.586092 -1.297807
C  2.921279 -0.259926 -0.864328
C  -0.352469 2.95566 0.3220
C  0.003524 1.977864 2.505334
C  -0.246797 3.121935 1.717912
C  -4.771062 -1.914557 0.013431
C  4.932707 -2.114136 -0.182915
C  -3.990667 -0.384978 -1.709654
C  4.249658 -0.058879 -1.28965
C  -5.06104 -1.045643 -1.063123
C  5.269643 -0.979358 -0.95565
H  0.17949 -0.713902 -1.255762
H  -1.217178 -3.662585 1.007009
H  -0.900677 -2.393533 2.230228
H  1.375827 -3.078988 1.924667
H  1.052493 -3.753693 0.294459
H  -0.302121 1.633621 -1.389453
H  0.353455 -0.169753 2.516149
H  -3.255957 -2.782122 1.293182
H  3.382177 -3.22265 0.841343
H  -1.85609 -0.075117 -1.836896
H  2.164311 0.484256 -1.126328
H  0.102099 2.080522 3.590716
H  -0.352758 4.118747 2.153478
H  -5.585083 -2.43176 0.534503
H  5.706254 -2.842551 0.086658
H  -4.190648 0.293153 -2.547012
H  4.487061 0.829063 -1.886765
H  -6.09377 -0.884025 -1.387889
H  6.299496 -0.816251 -1.28884
