program: Orca
programVersion: 6.0.x
elementType: C N O H H C H H H C C H H H C H H H C H H H
charge: 1
multiplicity: 1
keywords: wB97X-D3 def2-TZVPPD autoaux TightSCF
formula: C6H14NO
InChI: InChI=1/C6H14NO/c1-6(2,3)4-5-7-8/h5H,4,8H2,1-3H3
22 atoms
C  1.154326 -0.479891 -0.020942
N  2.069951 0.108144 -0.668384
O  3.371729 0.141509 0.312564
H  4.074057 -0.309946 -0.191865
H  3.614005 1.084701 0.36864
C  -0.157179 -0.633083 -0.726042
H  -0.326611 -1.714832 -0.808838
H  -0.082064 -0.222456 -1.737262
H  1.293735 -0.860058 0.991035
C  -1.33747 0.028801 0.04583
C  -1.511034 -0.611267 1.429848
H  -0.673965 -0.396141 2.104587
H  -2.407088 -0.210821 1.9115
H  -1.63332 -1.697265 1.35926
C  -2.595791 -0.221939 -0.798661
H  -3.466666 0.224294 -0.310652
H  -2.505012 0.225794 -1.793373
H  -2.791275 -1.292278 -0.918961
C  -1.089411 1.536488 0.178898
H  -0.934914 2.005463 -0.798499
H  -1.951548 2.019052 0.647014
H  -0.217304 1.756338 0.807104
totalener: -366.73880375415655 hartree
nucrepener: 398.61131517708998 hartree
electener: -765.35012824110754 hartree
oneelecener: -1274.69535713736400 hartree
twoeener: 509.34522889625646 hartree
kineticenergy: 364.84949160894638 hartree
xcener: -36.140847210265 hartree
energy: -532.5425 -400.3984 -286.8940 -284.5386 -284.0591 -282.8244 -282.8102 -282.5746 -39.7460 -33.9721 -29.7130 -27.1172 -25.5995 -25.3665 -25.2537 -23.8518 -23.4172 -21.3563 -21.2130 -19.4963 -19.2233 -18.7900 -17.7958 -17.7872 -17.2493 -17.0606 -16.3287 -16.2522 -15.9567 -15.1145 -15.0079 -14.9953 -4.5718 -3.7479 -2.8827 -1.5728 -1.3234 -1.0958 -0.4814 -0.4260 -0.1892 0.1888 0.2985 electronvolt
chargesum: 1.0000000
charge: -0.063309 -0.371806 -0.009985 0.259856 0.255585 -0.073821 0.308654 0.216437 0.286821 1.827001 -1.251780 0.228160 0.262862 0.250107 -1.426747 0.287516 0.266998 0.258967 -1.252044 0.251124 0.268231 0.221174
charge: 0.007028 0.264210 0.525185 -0.042301 -0.042203 0.038430 0.050335 0.040827 0.060123 -0.454054 0.163127 -0.007223 0.011679 0.010199 0.166088 0.010519 0.007723 0.008417 0.165061 0.009453 0.011311 -0.003934
qa: -0.0633 -0.3718 -0.0100 0.2599 0.2556 -0.0738 0.3087 0.2164 0.2868 1.8270 -1.2518 0.2282 0.2629 0.2501 -1.4267 0.2875 0.2670 0.2590 -1.2520 0.2511 0.2682 0.2212
va: 3.5782 2.0894 2.4738 0.9388 0.9578 3.4229 0.9180 1.0290 0.8123 1.5341 3.7983 1.0320 1.0087 1.0709 3.6964 0.9922 1.0369 1.0559 3.7466 1.0517 1.0071 1.0559
dispcorr: -0.007409918 hartree
energy: -366.746213672263
