program: Orca
programVersion: 6.0.x
elementType: C N O H H C H H C C C C H C H H H N O C H H H
charge: 1
multiplicity: 1
keywords: wB97X-D3 def2-TZVPPD autoaux TightSCF
formula: C8H11N2O2
InChI: InChI=1/C8H11N2O2/c1-12-6-8(10-11)7-2-4-9-5-3-7/h2-5H,6,11H2,1H3
23 atoms
C  0.859867 0.774631 0.286228
N  2.12528 0.924135 0.275384
O  2.821875 -0.4435 0.047582
H  3.647414 -0.403667 0.56278
H  2.262701 -1.216255 0.291571
C  0.118776 2.076775 0.524425
H  -0.33848 2.01183 1.527463
H  0.827547 2.916757 0.524564
C  0.1097 -0.489666 0.10684
C  -0.741502 -0.944731 1.115417
C  0.234432 -1.23237 -1.071722
C  -1.415674 -2.145894 0.902909
H  -0.880854 -0.395767 2.040538
C  -0.503295 -2.412042 -1.177348
H  0.843413 -0.886939 -1.901126
H  -2.082452 -2.539201 1.664438
H  -0.448228 -3.010167 -2.082157
N  -1.302693 -2.867431 -0.213477
O  -0.830208 2.159769 -0.486597
C  -1.580609 3.370153 -0.447226
H  -0.927876 4.237391 -0.601351
H  -2.303876 3.308703 -1.258399
H  -2.109024 3.469216 0.508643
totalener: -571.09197522403974 hartree
nucrepener: 697.11351752517317 hartree
electener: -1268.20548190152113 hartree
oneelecener: -2143.79953996119912 hartree
twoeener: 875.59405805967810 hartree
kineticenergy: 568.46153707716360 hartree
xcener: -54.000206572354 hartree
energy: -532.6854 -527.5763 -400.2672 -396.4520 -286.9883 -285.8868 -285.3876 -284.7963 -284.7689 -284.5143 -284.4697 -284.1661 -40.0222 -35.7281 -33.8802 -33.0219 -29.9877 -28.2227 -27.7904 -26.2004 -25.2526 -24.9174 -24.4569 -23.7510 -22.4842 -21.3600 -20.6180 -20.3707 -19.9566 -19.8738 -19.7285 -19.0179 -18.5794 -18.0538 -17.6365 -17.5054 -17.0674 -16.7846 -16.4940 -15.4897 -14.6932 -13.8130 -13.7370 -13.5220 -4.1807 -3.8486 -2.7246 -2.6770 -2.3413 -1.4559 -1.2722 -1.0091 -0.5141 -0.3980 -0.1946 electronvolt
chargesum: 1.0000000
charge: 0.338182 -0.486184 0.072011 0.211800 0.314478 -0.227701 0.252181 0.252604 0.570971 0.140658 -0.093698 -0.132106 0.095865 -0.046294 0.195170 0.135839 0.138406 -0.581749 -0.292452 -0.411639 0.206069 0.143872 0.203717
charge: -0.145474 0.283079 0.535336 -0.027994 -0.052616 -0.040475 0.058297 0.055027 -0.155555 0.098779 0.076891 -0.012100 0.026192 -0.014392 0.031746 0.027305 0.027659 0.122985 -0.087794 0.142200 0.016298 0.018047 0.016558
qa: 0.3382 -0.4862 0.0720 0.2118 0.3145 -0.2277 0.2522 0.2526 0.5710 0.1407 -0.0937 -0.1321 0.0959 -0.0463 0.1952 0.1358 0.1384 -0.5817 -0.2925 -0.4116 0.2061 0.1439 0.2037
va: 2.3221 1.7193 2.5746 0.9453 0.8905 3.8249 0.9795 1.0096 2.0312 3.0140 3.0140 3.4291 0.9765 3.4039 1.0041 0.9655 0.9707 2.1265 1.6062 3.8632 0.9988 1.0264 1.0088
dispcorr: -0.008082197 hartree
energy: -571.100057421168
