program: Orca
programVersion: 6.0.x
elementType: C N O H H C H H O H H C C C C H C H H H N O C H H H
charge: 1
multiplicity: 1
keywords: wB97X-D3 def2-TZVPPD autoaux TightSCF
formula: C8H13N2O3
InChI: InChI=1/C8H13N2O3/c1-12-6-8(10-13-14-11)7-2-4-9-5-3-7/h2-5,13H,6,11H2,1H3
26 atoms
C  0.41658 0.953272 0.763316
N  1.506992 0.994531 1.425962
O  2.059217 -0.36305 1.651302
H  2.262117 -0.962972 0.727587
H  2.869544 -0.182202 2.153255
C  -0.193699 2.320799 0.536547
H  -1.195874 2.317228 0.995689
H  0.419053 3.082555 1.037088
O  2.479591 -1.645544 -0.368427
H  2.941766 -2.492619 -0.336653
H  1.700504 -1.73048 -0.94101
C  -0.250571 -0.265038 0.236068
C  -0.723383 -1.2463 1.107655
C  -0.401641 -0.451134 -1.14219
C  -1.310003 -2.38609 0.55818
H  -0.643515 -1.134475 2.183497
C  -0.990844 -1.638762 -1.57814
H  -0.084074 0.310819 -1.844612
H  -1.694253 -3.16836 1.206479
H  -1.123444 -1.824095 -2.640477
N  -1.428152 -2.594898 -0.753795
O  -0.257458 2.514522 -0.845301
C  -0.902195 3.730949 -1.203279
H  -0.376081 4.592012 -0.774165
H  -0.869707 3.792484 -2.290079
H  -1.945971 3.731934 -0.866043
totalener: -647.57498644951011 hartree
nucrepener: 831.57384613938052 hartree
electener: -1479.14883452344179 hartree
oneelecener: -2516.74598869850661 hartree
twoeener: 1037.59715417506482 hartree
kineticenergy: 644.63586713928635 hartree
xcener: -60.522302569701 hartree
energy: -531.1817 -529.8265 -527.2667 -399.2864 -396.2466 -286.2062 -285.2756 -284.9275 -284.5620 -284.5421 -284.1402 -284.0746 -283.9408 -38.8446 -37.1175 -35.3290 -32.9639 -32.6561 -29.5129 -27.9103 -27.2919 -25.2575 -24.6110 -24.4290 -24.2043 -23.6381 -23.0634 -22.1555 -20.9729 -20.3086 -19.8938 -19.7337 -19.5581 -19.3526 -19.3037 -18.5538 -18.2542 -18.0327 -17.7724 -17.0916 -17.0032 -16.5667 -15.9082 -15.7155 -15.1801 -14.2883 -13.6409 -13.4250 -13.2978 -3.5811 -2.6897 -2.4703 -2.4333 -1.6938 -1.2669 -0.9632 -0.8467 -0.4302 -0.2771 -0.1923 electronvolt
chargesum: 1.0000000
charge: 0.526225 -0.574969 -0.018122 0.355682 0.222363 -0.283063 0.287189 0.235658 -0.226050 0.177393 0.257892 0.351652 0.166114 -0.129184 -0.114131 0.152189 -0.078620 0.165018 0.144075 0.134321 -0.595240 -0.291135 -0.415119 0.194151 0.143195 0.212517
charge: -0.142980 0.233996 0.416579 -0.207469 -0.056854 -0.033932 0.061654 0.051035 0.650537 -0.088785 -0.122501 -0.142568 0.083772 0.072034 -0.023523 0.027616 -0.033313 0.021897 0.024516 0.025057 0.112544 -0.114111 0.136598 0.015736 0.016222 0.016243
qa: 0.5262 -0.5750 -0.0181 0.3557 0.2224 -0.2831 0.2872 0.2357 -0.2260 0.1774 0.2579 0.3517 0.1661 -0.1292 -0.1141 0.1522 -0.0786 0.1650 0.1441 0.1343 -0.5952 -0.2911 -0.4151 0.1942 0.1432 0.2125
va: 2.3763 1.7536 2.3246 0.9441 0.8701 3.6993 0.9685 1.0587 2.2114 1.0135 0.9877 2.1260 2.9582 3.0187 3.4083 0.9938 3.2806 1.0088 0.9555 0.9927 2.0498 1.6288 3.8647 1.0035 1.0361 1.0097
dispcorr: -0.011126885 hartree
energy: -647.586113334522
