program: Gaussian 09
title: 000052729
version: EM64L-G09RevD.01
frameworkgroup: C1[X(C15H20F3NO2)]
method: RPBEPBE
basis: SDD
operation: Freq
keyword: #p
keyword: freq=noraman
keyword: PBEPBE/SDD
title: #p freq=noraman PBEPBE/SDD
converged: YES YES NO NO
title: Mulliken charges:
elementType: F F F O O N C C C C C C C C C C C C C C C H H H H H H H H H H H H H H H H H H H H
charge: -0.166340 -0.168288 -0.168507 -0.264794 -0.249069 -0.295807 -0.099129 -0.594921 0.528145 -0.702112 -0.374730 -0.536861 -0.303160 -0.391034 0.293815 -0.213119 -0.353287 0.243705 0.282288 -0.485171 -0.658352 0.232459 0.239502 0.204860 0.245001 0.231607 0.198413 0.240229 0.247679 0.204056 0.266687 0.217804 0.241961 0.247452 0.236999 0.264317 0.241305 0.243377 0.231877 0.215174 0.225971
chargesum: 0.00000
title: Mulliken charges with hydrogens summed into heavy atoms:
elementType: F F F O O N C C C C C C C C C C C C C C C
charge: -0.166340 -0.168288 -0.168507 -0.264794 -0.249069 -0.050806 0.133329 -0.150559 0.528145 -0.031863 0.077004 -0.270174 0.156605 -0.143582 0.293815 0.023880 -0.088970 0.243705 0.282288 -0.000490 0.014670
polarizability: 2.33448396e+02 3.77593389e+00 1.71136314e+02 7.60494293e+00 9.81815001e-01 1.26115101e+02
1716.lowfreq: -2.0762 -0.0007 0.0008 0.0010 3.0323 5.9236 11.6785 13.4374 15.2371
frequency: 11.5212 13.1407 15.1560 18.6605 29.2045 42.2813 44.6749 73.4365 83.2462 102.1168 124.6438 151.9516 171.0066 181.7992 196.1861 216.3993 231.3334 247.5408 286.3340 297.6672 303.7933 315.1814 333.8654 368.0822 390.4188 422.0894 428.3542 448.6853 500.4550 504.6174 522.6765 552.5255 581.8630 608.7014 621.6580 637.3500 663.5302 700.4292 710.4909 781.4749 792.7564 803.8572 819.0156 839.4405 852.7826 897.7239 914.1013 921.0574 932.4756 934.9346 981.9843 989.5724 993.1784 1013.5799 1014.2307 1032.6017 1039.6772 1060.9383 1068.2019 1082.6473 1085.3635 1105.2504 1119.3099 1130.5094 1132.4827 1166.5444 1188.2406 1199.8402 1201.6044 1224.8690 1242.3930 1277.9689 1291.8505 1300.6596 1309.9986 1315.4836 1325.1167 1336.9480 1348.1375 1379.9120 1383.7407 1389.3203 1399.2748 1440.0888 1443.6123 1448.3509 1457.7215 1466.5627 1471.1155 1474.1307 1479.0359 1480.5982 1481.8796 1490.6198 1598.9904 1619.2783 1645.8841 2916.4979 2970.0565 2977.8380 2990.7469 2998.0207 3000.7391 3035.7460 3046.3696 3049.7419 3050.1471 3067.3110 3078.0972 3096.8310 3103.4149 3114.8347 3127.3192 3148.8774 3151.8454 3172.7028 3427.0204
redmass: 9.9392 7.2689 4.3298 2.0496 5.3903 5.2422 3.1877 3.7102 3.6225 2.8041 6.6452 4.1756 2.7228 1.3150 3.4230 1.7386 1.7883 3.2252 4.0581 4.0294 5.9240 4.1130 7.2871 3.0983 4.3353 2.9895 2.9030 4.0874 3.9679 3.8179 7.5488 3.0018 4.5722 11.5233 3.7249 5.3077 1.5823 3.9248 2.6353 1.8978 1.3549 1.7740 1.7533 2.0304 3.4661 1.4388 2.2165 2.2434 1.6227 1.9818 9.0563 6.0418 1.3780 6.1131 1.7862 2.1190 2.0295 3.4569 2.4830 2.9933 1.6591 1.8691 2.8596 2.4513 2.2998 2.3194 1.1178 1.3821 1.7909 1.3505 1.1761 1.2102 1.8526 1.7155 1.3184 1.4077 1.2817 1.5895 1.3994 1.2900 1.2918 7.5958 1.2128 2.8003 1.0998 1.1174 1.1625 1.0694 1.0394 1.2384 1.1337 1.0514 1.8518 1.0794 6.1048 6.2628 8.8324 1.0693 1.0373 1.0683 1.0769 1.0495 1.0478 1.0583 1.0983 1.0996 1.0898 1.0983 1.0994 1.1003 1.1003 1.1100 1.0887 1.0920 1.0916 1.0983 1.0738
irintensity: 0.4383 0.9290 0.3467 0.3798 1.1716 1.0177 0.5661 0.6308 2.3752 1.2078 0.2266 0.3040 0.9873 0.2323 2.7294 1.0865 0.4108 1.3600 1.3864 23.8982 0.3922 11.2434 3.2605 3.4290 2.0723 3.6954 2.4301 0.4091 4.1598 15.9011 0.7881 9.2820 5.4046 18.7164 11.3847 8.3605 65.4505 12.5982 18.1032 10.8107 17.0396 49.2875 16.7056 0.1851 38.3578 13.4286 22.3092 15.6655 31.9964 9.3497 196.2069 5.0503 1.6442 150.4572 57.5114 41.8578 30.9245 26.7183 72.0620 66.8043 1.6320 8.9680 45.9858 259.2466 83.0428 58.9548 2.1584 14.3350 92.6874 18.8926 0.6586 8.0826 129.0016 80.9614 4.0698 32.5021 3.3156 14.7958 49.1980 16.4623 8.9035 1.5319 18.9788 33.5962 34.3740 5.4080 19.8449 1.3530 12.6245 3.5646 18.3021 15.9308 4.6743 6.4922 7.7851 4.5447 137.0940 65.3825 19.2937 9.1071 29.3415 34.3097 7.2005 28.4906 4.7063 15.2805 8.3421 38.8466 46.1210 32.2708 31.8618 16.6313 7.5854 4.9644 7.1106 7.3167 0.5660
temp: 298.150 k
press: 1.00000 atm
elementType: 9 9 9 8 8 7 6 6 6 6 6 6 6 6 6 6 6 6 6 6 6 1 1 1 1 1 1 1 1 1 1 1 1 1 1 1 1 1 1 1 1
symmnumber: 1
zpe: 857101.3 jmol-1
zpe.correction: 0.326453 hartree
zpe.thermalcorrener: 0.349217 hartree
zpe.thermalcorrenthalpy: 0.350161 hartree
zpe.thermalcorrgfe: 0.267698 hartree
zpe.sumelectzpe: -1086.720497 hartree
zpe.sumelectthermal: -1086.697733 hartree
zpe.sumelectthermalent: -1086.696789 hartree
zpe.sumelectthermalfe: -1086.779251 hartree
dipole: -3.7243 -0.4568 -0.4680
dipole: 3.7813
quadrupole: -142.6784 -118.5272 -126.2810
quadrupole: 14.7073 -8.2963 1.6248
quadrupole: -13.5162 10.6350 2.8812 14.7073 -8.2963 1.6248
hfenergy: -1087.0469492 hartree
pointgroup: C01 [X(C15H20F3N1O2)]
dipole: 1.4720295 -0.082611 0.1986942 debye
polarizability: 233.8405465|-0.3445067|164.3648106|5.9892289|-16.0151839|132.4944541 unknown
InChI: InChI=1S/C15H20F3NO2/c1-3-14(20)21-8-7-19-11(2)9-12-5-4-6-13(10-12)15(16,17)18/h4-6,10-11,19H,3,7-9H2,1-2H3
charge 0 multiplicity 1
41 atoms
F  -6.646478 0.17146 -0.116904
F  -5.451505 -1.257359 -1.402894
F  -5.566994 -1.587577 0.834006
O  5.444578 -0.807178 0.62399
O  5.290596 1.262825 -0.445174
N  1.706228 -0.76914 1.168902
C  0.468294 -0.455174 0.409699
C  -0.643339 -0.081485 1.436418
C  -1.89441 0.496708 0.797546
C  0.01762 -1.583482 -0.554173
C  2.956657 -0.877907 0.388927
C  -3.071242 -0.274711 0.650511
C  4.145123 -0.543083 1.309314
C  -1.90064 1.833389 0.317103
C  -4.22104 0.277497 0.039683
C  -3.049076 2.384318 -0.291405
C  -4.219032 1.608683 -0.436763
C  -5.442341 -0.573987 -0.148349
C  5.913372 0.197239 -0.234199
C  7.254324 -0.204559 -0.828765
C  7.776205 0.807472 -1.863644
H  0.692423 0.451027 -0.188921
H  -0.195588 0.648376 2.136187
H  -0.900331 -0.985231 2.024905
H  1.568826 -1.575413 1.795195
H  0.825051 -1.837485 -1.264654
H  -0.241807 -2.499265 0.012598
H  -0.868148 -1.284499 -1.14315
H  2.923971 -0.135402 -0.428366
H  3.124634 -1.877546 -0.073852
H  -3.096942 -1.304257 1.023562
H  4.17279 -1.20216 2.192828
H  4.09512 0.513682 1.620951
H  -0.999835 2.448211 0.434168
H  -3.03767 3.419605 -0.64746
H  -5.117081 2.031551 -0.897298
H  7.143528 -1.213848 -1.268312
H  7.969779 -0.322818 0.008248
H  7.887213 1.809374 -1.415497
H  8.758154 0.485579 -2.252876
H  7.078211 0.90277 -2.713086
