program: Orca
programVersion: 6.0.x
elementType: C N O H H C H H C H H C H H F O C H H H
charge: 1
multiplicity: 1
keywords: wB97X-D3 def2-TZVPPD autoaux TightSCF
formula: C5H11FNO2
InChI: InChI=1/C5H11FNO2/c1-9-4-5(7-8)2-3-6/h2-4,8H2,1H3
20 atoms
C  0.786065 -0.095624 0.140628
N  2.029655 -0.25508 0.335367
O  2.438817 -1.774759 -0.117595
H  3.075616 -1.647622 -0.844985
H  2.936941 -2.115312 0.648042
C  0.381566 1.303108 0.611621
H  -0.168546 1.165104 1.559125
H  1.271452 1.911593 0.824269
C  -0.243409 -0.987388 -0.46952
H  -0.489015 -0.532873 -1.437369
H  0.151724 -1.988592 -0.638513
C  -1.533653 -1.069333 0.358224
H  -2.027003 -0.09689 0.425187
H  -1.349456 -1.472903 1.358846
F  -2.372712 -1.938463 -0.303441
O  -0.411669 1.829913 -0.398295
C  -0.777393 3.190836 -0.171735
H  0.112074 3.830548 -0.144188
H  -1.410225 3.479242 -1.009047
H  -1.337274 3.291312 0.765317
totalener: -501.88421570361351 hartree
nucrepener: 482.10172664611667 hartree
electener: -983.98593938493775 hartree
oneelecener: -1629.97718000639634 hartree
twoeener: 645.99124062145859 hartree
kineticenergy: 499.70762136962821 hartree
xcener: -45.353457899487 hartree
energy: -677.5735 -532.4658 -527.8917 -400.3559 -287.1729 -286.1802 -285.8047 -284.8524 -284.4061 -39.6712 -39.2850 -36.0264 -34.0462 -29.2283 -27.6485 -25.5606 -25.1019 -25.0599 -23.4491 -22.0240 -21.7138 -20.8001 -20.4247 -20.0267 -19.8607 -19.5813 -18.9825 -18.2000 -17.7313 -17.6232 -17.0438 -16.8482 -15.8553 -15.6980 -15.6349 -14.0516 -4.5973 -3.6644 -2.8451 -1.5952 -1.3446 -0.9870 -0.6639 -0.6190 -0.4326 -0.0972 0.0306 electronvolt
chargesum: 1.0000000
charge: 0.403921 -0.494543 -0.024790 0.258479 0.252939 -0.266612 0.262932 0.268872 0.302308 0.201791 0.138462 -0.170704 0.177004 0.183083 -0.334991 -0.310563 -0.420970 0.200576 0.160399 0.212408
charge: -0.152714 0.285394 0.525852 -0.039750 -0.041439 -0.041625 0.063770 0.053400 0.086687 0.057989 0.027707 -0.030924 0.036984 0.046286 0.018767 -0.103116 0.151343 0.017065 0.019705 0.018620
qa: 0.4039 -0.4945 -0.0248 0.2585 0.2529 -0.2666 0.2629 0.2689 0.3023 0.2018 0.1385 -0.1707 0.1770 0.1831 -0.3350 -0.3106 -0.4210 0.2006 0.1604 0.2124
va: 3.5642 1.7043 2.4508 0.9581 0.9611 3.8619 0.9935 0.9510 3.3369 1.0434 1.1441 3.6843 1.0365 0.9783 0.8219 1.6288 3.8508 1.0003 1.0184 1.0148
dispcorr: -0.006311362 hartree
energy: -501.890527065685
