program: Orca
programVersion: 6.0.x
elementType: C N O H H C H H C C C C H C H C H H O C H H H O C H H H
charge: 1
multiplicity: 1
keywords: wB97X-D3 def2-TZVPPD autoaux TightSCF
formula: C10H14NO3
InChI: InChI=1/C10H14NO3/c1-13-7-10(11-12)8-3-5-9(14-2)6-4-8/h3-6H,7,12H2,1-2H3
28 atoms
C  0.780797 1.733185 0.169127
N  1.958178 2.226297 0.051876
O  2.998379 1.075168 -0.012356
H  3.771311 1.412901 0.4731
H  2.635692 0.24785 0.388327
C  -0.252232 2.831453 0.347268
H  -0.579271 2.806413 1.401961
H  0.216181 3.809997 0.168689
C  0.388733 0.320871 0.177099
C  -0.528382 -0.145092 1.141148
C  0.842999 -0.565999 -0.813579
C  -0.926709 -1.46209 1.144458
H  -0.92051 0.529119 1.895196
C  0.428781 -1.891497 -0.827918
H  1.474667 -0.209362 -1.622803
C  -0.454049 -2.352191 0.160211
H  -1.620955 -1.836136 1.888091
H  0.7754 -2.544904 -1.618496
O  -0.911106 -3.599865 0.246102
C  -0.511313 -4.565916 -0.723063
H  0.572392 -4.717875 -0.695761
H  -1.015727 -5.487367 -0.440302
H  -0.830984 -4.265785 -1.725877
O  -1.291171 2.55875 -0.534124
C  -2.298341 3.562281 -0.527184
H  -1.886812 4.531141 -0.835424
H  -3.054128 3.244087 -1.243341
H  -2.75267 3.655644 0.467376
totalener: -669.61120521583723 hartree
nucrepener: 894.09896361847166 hartree
electener: -1563.71018869593718 hartree
oneelecener: -2669.33369560817482 hartree
twoeener: 1105.62350691223764 hartree
kineticenergy: 666.50044285913236 hartree
xcener: -63.402335384912 hartree
energy: -532.1032 -527.8025 -527.1630 -399.4932 -286.3400 -285.4815 -285.3895 -284.4050 -284.2630 -284.1359 -284.0488 -283.8577 -283.6383 -283.4993 -39.4533 -36.0000 -35.3062 -33.1490 -30.6521 -28.1420 -27.7634 -27.0998 -25.9956 -25.3111 -24.6531 -23.8651 -23.4486 -23.0319 -21.9185 -20.8471 -20.7646 -20.1326 -19.7408 -19.4120 -19.3004 -19.0396 -18.7366 -18.2342 -17.8289 -17.5930 -17.2481 -17.0241 -16.9084 -16.4547 -16.1225 -15.9981 -15.2271 -15.0868 -14.9958 -13.4912 -13.3094 -12.2732 -3.5908 -3.2672 -2.3031 -2.0341 -1.4306 -1.2044 -0.9410 -0.8666 -0.4199 -0.2581 -0.1455 electronvolt
chargesum: 1.0000000
charge: 0.425318 -0.548315 0.055341 0.213251 0.316926 -0.260447 0.250119 0.259053 0.759160 -0.330692 -0.559553 -0.463921 0.005443 0.008965 0.165444 0.988797 0.116148 0.089584 -0.463407 -0.478637 0.227779 0.144191 0.229654 -0.299165 -0.404836 0.207042 0.144980 0.201778
charge: -0.154851 0.263392 0.517765 -0.034011 -0.061298 -0.049455 0.054638 0.052168 -0.158662 0.088432 0.058381 0.121515 0.028533 0.101618 0.032577 -0.220482 0.035024 0.013827 0.000919 0.157039 0.018126 0.020657 0.019404 -0.087068 0.134409 0.015096 0.016553 0.015755
qa: 0.4253 -0.5483 0.0553 0.2133 0.3169 -0.2604 0.2501 0.2591 0.7592 -0.3307 -0.5596 -0.4639 0.0054 0.0090 0.1654 0.9888 0.1161 0.0896 -0.4634 -0.4786 0.2278 0.1442 0.2297 -0.2992 -0.4048 0.2070 0.1450 0.2018
va: 2.1499 1.6300 2.5420 0.9295 0.9030 3.7834 0.9719 0.9846 1.0446 3.2937 2.9229 3.4663 0.9829 3.1769 1.0420 2.5093 1.0086 0.9364 1.5999 3.8028 0.9573 1.0538 0.9593 1.6111 3.8487 0.9992 1.0247 1.0152
dispcorr: -0.010120235 hartree
energy: -669.621325451328
