program: Gaussian 09
title: 000052753
version: EM64L-G09RevD.01
frameworkgroup: C1[X(C15H6Cl10S2)]
method: RPBEPBE
basis: SDD
operation: Freq
keyword: #p
keyword: freq=noraman
keyword: PBEPBE/SDD
title: #p freq=noraman PBEPBE/SDD
converged: NO YES NO NO
title: Mulliken charges:
elementType: Cl Cl Cl Cl Cl Cl Cl Cl Cl Cl S S C C C C C C C C C C C C C C C H H H H H H
charge: 0.033170 0.033166 0.033174 0.033178 0.061359 0.061360 0.061357 0.061354 0.068521 0.068520 0.238140 0.238137 0.758425 0.758428 -0.788543 -0.788544 -0.824427 -0.329905 -0.329906 -0.329926 -0.329927 -0.078099 -0.078087 -0.078113 -0.078121 -0.097918 -0.097918 0.286302 0.286318 0.286333 0.286290 0.287979 0.287923
chargesum: 0.00000
title: Mulliken charges with hydrogens summed into heavy atoms:
elementType: Cl Cl Cl Cl Cl Cl Cl Cl Cl Cl S S C C C C C C C C C C C C C C C
charge: 0.033170 0.033166 0.033174 0.033178 0.061359 0.061360 0.061357 0.061354 0.068521 0.068520 0.238140 0.238137 0.758425 0.758428 -0.215922 -0.215922 -0.248524 -0.329905 -0.329906 -0.329926 -0.329927 -0.078099 -0.078087 -0.078113 -0.078121 -0.097918 -0.097918
polarizability: 4.63528338e+02 1.38285319e-02 3.40348362e+02 1.13398598e-04 -5.14639947e-04 1.60024465e+02
1716.lowfreq: -15.9534 -0.0018 -0.0003 0.0013 1.8349 2.5353 5.8320 6.3511 6.8109
frequency: -15.8804 5.5997 6.6994 15.0051 29.4262 31.2276 39.9275 52.3096 59.0935 63.1866 65.9103 66.8361 77.0530 85.8589 110.8972 163.2527 168.6771 191.7917 205.5830 205.5852 208.1663 209.0874 217.9060 217.9182 218.0513 226.3423 251.3800 307.1184 307.1720 322.0057 322.1785 329.8495 329.8593 338.8717 340.4081 347.7128 351.9302 357.5456 364.3759 469.9244 478.6120 583.4784 585.4189 585.4665 587.0850 596.8446 596.8594 623.6487 623.9380 658.4404 686.5595 693.8825 703.5151 712.9093 725.1748 781.1537 788.0416 813.6155 813.8365 848.3309 902.9951 915.3296 917.1262 917.3727 1067.7085 1068.4383 1086.5098 1139.2026 1139.5258 1195.0302 1224.3215 1224.4229 1253.7714 1271.3129 1328.2635 1328.6100 1342.2952 1342.3864 1360.9803 1361.1217 1423.8152 1446.1473 1447.7950 1522.9175 1523.1235 1548.3289 1548.4052 3010.0246 3041.6631 3041.7553 3095.9108 3118.1562 3118.6092
redmass: 23.8105 20.1203 25.1560 19.7551 2.6860 23.8817 15.5006 14.4286 14.2119 25.7809 32.1069 26.6511 29.1949 28.9596 16.1429 13.6910 10.4362 15.0961 29.0513 29.0647 32.1085 32.3370 30.5010 30.5309 26.5859 19.8025 12.1627 24.3994 24.8147 23.2441 25.4402 12.3838 12.3666 2.9371 2.9023 15.5781 25.0305 20.9236 13.3568 8.8002 8.7809 11.8545 5.0959 5.0969 12.2874 11.9732 11.9794 12.2762 12.2622 7.4188 8.2837 8.9403 9.8563 9.2806 9.1558 10.0435 10.1409 12.4666 12.4614 1.3059 1.4916 8.8997 8.8362 1.5019 9.4135 9.3418 1.0294 1.1807 1.1840 1.1416 11.1384 9.4202 1.1859 1.1967 8.8434 8.9079 6.9560 6.8881 9.9385 9.9009 1.0747 1.1136 1.1126 9.8021 9.7799 11.3755 11.4149 1.0514 1.0562 1.0563 1.1139 1.1087 1.1088
irintensity: 0.0000 0.0000 0.0515 0.0345 2.6587 0.1168 0.0000 1.4870 0.2030 0.0350 0.0000 0.2017 0.0352 0.0384 0.1274 0.1971 0.0159 0.2172 0.2331 0.0000 0.0073 0.1260 0.0000 0.0938 0.0008 0.0049 1.0046 0.0000 0.5914 0.3427 0.0002 0.0000 0.0000 0.0000 4.5003 1.4208 0.0055 0.0002 0.0131 2.5085 34.4079 12.2506 2.4436 0.0001 0.2352 0.0000 0.0332 0.0003 107.9839 0.0176 3.5511 0.1087 14.2385 59.4809 3.5681 5.4197 0.8900 0.0000 2.9535 0.6821 0.0000 0.0252 0.1262 45.0382 20.5596 9.9972 0.0000 0.0005 50.4292 87.2211 12.0396 85.9225 0.6325 0.0377 0.0021 264.5924 0.0006 32.1894 144.4507 18.6979 0.4443 25.6351 17.1796 0.0000 0.2041 4.6389 13.9521 25.0002 0.0063 21.9355 11.5198 0.0000 0.1801
temp: 298.150 k
press: 1.00000 atm
elementType: 17 17 17 17 17 17 17 17 17 17 16 16 6 6 6 6 6 6 6 6 6 6 6 6 6 6 6 1 1 1 1 1 1
symmnumber: 1
zpe: 439280.2 jmol-1
zpe.correction: 0.167313 hartree
zpe.thermalcorrener: 0.196333 hartree
zpe.thermalcorrenthalpy: 0.197277 hartree
zpe.thermalcorrgfe: 0.098265 hartree
zpe.sumelectzpe: -5969.913266 hartree
zpe.sumelectthermal: -5969.884246 hartree
zpe.sumelectthermalent: -5969.883302 hartree
zpe.sumelectthermalfe: -5969.982314 hartree
dipole: 0.0000 -0.0007 4.0259
dipole: 4.0259
quadrupole: -252.0352 -244.1015 -233.5176
quadrupole: -0.0016 0.0000 -0.0006
quadrupole: -8.8171 -0.8834 9.7005 -0.0016 0.0000 -0.0006
hfenergy: -5970.0805791 hartree
pointgroup: C01 [X(C15H6Cl10S2)]
dipole: -0.0000061 -0.0014433 -1.5838911 debye
polarizability: 463.5283372|-0.0173266|340.3482621|-0.0000682|-0.1346611|160.0245656 unknown
InChI: InChI=1S/C15H6Cl10S2/c16-6-4(7(17)11(21)14(24)10(6)20)1-26-3-27-2-5-8(18)12(22)15(25)13(23)9(5)19/h1-3H2
charge 0 multiplicity 1
33 atoms
Cl -4.064187 2.784563 -0.62581
Cl 4.063953 -2.785917 -0.621701
Cl -4.064061 -2.786105 -0.620375
Cl 4.064301 2.784752 -0.624509
Cl -6.991512 -2.779927 0.682703
Cl 6.991771 2.780234 0.678561
Cl -6.991759 2.780724 0.677292
Cl 6.991504 -2.780421 0.68142
Cl -8.457244 0.00099 1.335153
Cl 8.457248 0.000174 1.335146
S  -1.522049 -0.000113 0.244786
S  1.522047 -0.000215 0.244786
C  -4.199467 -0.000691 -0.561035
C  4.199466 -0.000581 -0.561042
C  -2.820207 -0.001183 -1.164633
C  2.820209 -0.00087 -1.16464
C  -0.000001 -0.001782 -0.873349
C  -4.877962 1.210727 -0.261609
C  4.877862 -1.211615 -0.259828
C  -4.8779 -1.211581 -0.259292
C  4.878002 1.210694 -0.261088
C  -6.168272 -1.224035 0.316255
C  6.168379 1.223879 0.314438
C  -6.168353 1.224206 0.313897
C  6.168245 -1.224362 0.315702
C  -6.815947 0.000343 0.604002
C  6.815946 -0.000125 0.603998
H  -2.655153 -0.907636 -1.766168
H  -2.655115 0.904287 -1.767639
H  2.655113 0.904775 -1.767372
H  2.655142 -0.90715 -1.766441
H  -0.000028 -0.913437 -1.493453
H  0.000029 0.9081 -1.496055
