program: Orca
programVersion: 6.0.x
elementType: C N O H H C H H C H H C H H H C F F F
charge: 1
multiplicity: 1
keywords: wB97X-D3 def2-TZVPPD autoaux TightSCF
formula: C5H9F3NO
InChI: InChI=1/C5H9F3NO/c1-2-4(9-10)3-5(6,7)8/h2-3,10H2,1H3
19 atoms
C  0.899479 0.107479 0.273599
N  1.597303 1.1508 0.494656
O  3.035892 0.982725 -0.226983
H  3.049685 1.678637 -0.910851
H  3.670619 1.242828 0.466369
C  -0.444172 0.297946 0.959064
H  -0.614438 -0.536596 1.644236
H  -0.454058 1.227161 1.532983
C  1.22426 -1.13791 -0.495373
H  0.59605 -1.117256 -1.39418
H  2.264082 -1.107581 -0.818887
C  0.938614 -2.419129 0.303067
H  -0.127394 -2.553245 0.493186
H  1.276634 -3.273864 -0.285097
H  1.47885 -2.432187 1.253108
C  -1.593698 0.362244 -0.046248
F  -2.716796 0.708323 0.57548
F  -1.332704 1.267509 -1.004106
F  -1.79409 -0.820341 -0.651521
totalener: -625.21541555340025 hartree
nucrepener: 603.55527037842069 hartree
electener: -1228.77070552311943 hartree
oneelecener: -2044.45809511803031 hartree
twoeener: 815.68738959491088 hartree
kineticenergy: 622.71972095523472 hartree
xcener: -53.851841809402 hartree
energy: -679.1395 -679.1354 -679.0529 -532.7247 -400.4645 -290.6316 -287.4129 -285.4436 -284.9976 -283.7794 -42.8675 -40.4009 -40.3817 -39.9540 -34.3008 -29.6748 -28.8851 -25.8193 -25.7793 -25.3102 -24.1355 -23.0337 -22.9718 -22.1920 -21.9219 -21.5082 -20.1601 -19.6623 -19.5009 -19.0772 -18.8805 -18.4763 -18.1695 -17.9938 -17.7852 -17.6604 -17.2102 -16.7897 -16.5962 -16.5164 -4.5473 -3.8598 -2.9033 -1.6896 -1.3664 -1.1230 -0.6661 -0.4995 -0.3447 -0.0216 0.0601 electronvolt
chargesum: 1.0000000
charge: 0.494476 -0.507401 -0.013422 0.265565 0.260878 -0.328575 0.200996 0.154724 0.339253 0.184198 0.200022 -0.901808 0.201579 0.229996 0.211154 0.900259 -0.294185 -0.310515 -0.287195
charge: -0.175478 0.280625 0.528666 -0.033719 -0.035972 0.146140 0.055556 0.051980 0.028863 0.044133 0.017393 0.179758 -0.006958 0.007308 0.007139 -0.585771 0.179715 0.156546 0.154073
qa: 0.4945 -0.5074 -0.0134 0.2656 0.2609 -0.3286 0.2010 0.1547 0.3393 0.1842 0.2000 -0.9018 0.2016 0.2300 0.2112 0.9003 -0.2942 -0.3105 -0.2872
va: 3.2627 1.7279 2.4600 0.9500 0.9450 4.4026 0.9687 1.0623 3.0623 1.0516 1.0384 3.9075 1.0029 1.0545 1.0464 3.2034 0.8851 0.8891 0.9345
dispcorr: -0.006828736 hartree
energy: -625.222244289264
