program: Orca
programVersion: 6.0.x
elementType: C N O H H C H H O H H C C C C C H C H C H H F O C H H H F F
charge: 1
multiplicity: 1
keywords: wB97X-D3 def2-TZVPPD autoaux TightSCF
formula: C10H13F3NO3
InChI: InChI=1/C10H11F3NO2.H2O/c1-16-8-4-2-7(3-5-8)9(14-15)6-10(11,12)13;/h2-5H,6,15H2,1H3;1H2
30 atoms
C  1.356215 -0.281526 0.284139
N  2.084389 -1.282568 -0.058334
O  1.267254 -2.437188 -0.432754
H  1.814196 -3.304176 -0.139279
H  0.354886 -2.35966 -0.067046
C  2.168587 0.916226 0.703175
H  1.891878 1.221367 1.716346
H  3.232369 0.67187 0.687949
O  2.548715 -4.416066 0.243952
H  3.351934 -4.282667 0.761363
H  2.711875 -5.126801 -0.387451
C  1.94535 2.109598 -0.220899
C  -0.119525 -0.252287 0.296161
C  -0.80993 0.109424 1.469181
C  -0.850217 -0.500558 -0.874725
C  -2.185721 0.179756 1.4746
H  -0.266271 0.325712 2.383723
C  -2.23707 -0.409539 -0.882294
H  -0.332161 -0.71694 -1.805073
C  -2.915123 -0.074076 0.297677
H  -2.730402 0.44467 2.373557
H  -2.771301 -0.580745 -1.808269
F  2.820887 3.077329 0.066137
O  -4.240253 0.036065 0.406435
C  -5.056595 -0.153672 -0.745309
H  -4.943989 -1.168032 -1.141792
H  -6.079455 -0.006878 -0.404873
H  -4.816856 0.585175 -1.516481
F  2.112735 1.758126 -1.507998
F  0.709836 2.618599 -0.097948
totalener: -968.67269531743045 hartree
nucrepener: 1287.12718460818451 hartree
electener: -2255.79988718330196 hartree
oneelecener: -3869.28652857811403 hartree
twoeener: 1613.48664139481207 hartree
kineticenergy: 964.65995777639614 hartree
xcener: -85.706514627244 hartree
energy: -678.2875 -678.2623 -678.2270 -531.1051 -529.3207 -527.5709 -398.9455 -289.7208 -286.0980 -285.2277 -284.3665 -284.1174 -283.9870 -283.9575 -283.8477 -283.4097 -283.3018 -41.9943 -39.5304 -39.5133 -38.8746 -36.6282 -35.7642 -32.5944 -30.4101 -28.5560 -27.7021 -27.4272 -25.8089 -24.9790 -24.8065 -23.7755 -23.4923 -23.1618 -23.0077 -22.1741 -22.1339 -21.5602 -21.2769 -20.5352 -20.4364 -19.8059 -19.2120 -18.8716 -18.8138 -18.7460 -18.5802 -18.4579 -18.1283 -18.0000 -17.4967 -17.4296 -17.3336 -17.2751 -17.0362 -16.9515 -16.7914 -16.5540 -16.0293 -15.7189 -15.4288 -14.9327 -14.7728 -13.2052 -12.0577 -3.1878 -2.4009 -2.1400 -1.6204 -1.4997 -1.1079 -0.7644 -0.6027 -0.4443 -0.2745 -0.0838 electronvolt
chargesum: 1.0000000
charge: 0.102706 -0.562700 0.005393 0.399803 0.292577 -0.381175 0.198659 0.165849 -0.249311 0.199517 0.193425 0.975121 0.949772 0.038862 -0.355378 -0.621526 0.032663 -0.385723 0.164944 0.924472 0.111202 0.070248 -0.311502 -0.469109 -0.477699 0.221440 0.143909 0.232032 -0.314432 -0.294040
charge: -0.179448 0.224356 0.442453 -0.214798 -0.069666 0.137592 0.050715 0.049429 0.612761 -0.108222 -0.107560 -0.582562 -0.174687 0.077829 0.060930 0.117465 0.028114 0.100873 0.035227 -0.222758 0.033840 0.012996 0.161912 -0.003248 0.152806 0.016805 0.019952 0.019503 0.151098 0.156294
qa: 0.1027 -0.5627 0.0054 0.3998 0.2926 -0.3812 0.1987 0.1658 -0.2493 0.1995 0.1934 0.9751 0.9498 0.0389 -0.3554 -0.6215 0.0327 -0.3857 0.1649 0.9245 0.1112 0.0702 -0.3115 -0.4691 -0.4777 0.2214 0.1439 0.2320 -0.3144 -0.2940
va: 2.2193 1.7689 2.2635 0.7803 0.9300 4.5814 1.0020 1.0685 2.1592 1.0126 1.0034 2.9784 1.5001 3.1770 3.2058 3.5696 0.9956 3.4876 1.0199 2.6566 1.0107 0.9589 0.8488 1.5614 3.8063 0.9561 1.0537 0.9608 0.8745 0.9307
dispcorr: -0.012370820 hartree
energy: -968.685066137711
