program: Gaussian 09
title: 000052748
version: EM64L-G09RevD.01
frameworkgroup: C1[X(C19H22N2OS)]
method: RPBEPBE
basis: SDD
operation: Freq
keyword: #p
keyword: freq=noraman
keyword: PBEPBE/SDD
title: #p freq=noraman PBEPBE/SDD
converged: YES YES NO NO
title: Mulliken charges:
elementType: S O N N C C C C C C C C C C C C C C C C C C C H H H H H H H H H H H H H H H H H H H H H H
charge: 0.234354 -0.269363 -0.080376 -0.295238 -0.167690 -0.426543 -0.407729 -0.462547 0.444062 0.633035 0.394655 -0.403439 -0.414214 -0.610726 -0.930277 -0.636922 -0.396872 -0.234089 0.337287 -0.264189 -0.249252 -0.382036 -0.536427 0.241668 0.244368 0.190727 0.180341 0.234277 0.194184 0.279351 0.232215 0.261544 0.292479 0.261111 0.225985 0.220523 0.194890 0.227511 0.252255 0.229690 0.229143 0.244452 0.221339 0.221343 0.245140
chargesum: 0.00000
title: Mulliken charges with hydrogens summed into heavy atoms:
elementType: S O N N C C C C C C C C C C C C C C C C C C C
charge: 0.234354 -0.269363 -0.080376 -0.015887 0.073978 0.008552 0.006890 -0.268363 0.444062 0.633035 0.394655 -0.403439 -0.181999 -0.349182 -0.376687 0.004475 -0.169361 0.018166 0.337287 -0.034499 -0.020109 -0.137583 0.151395
polarizability: 2.90136281e+02 -3.70280660e+01 2.08580871e+02 1.01853047e+00 8.60455239e-01 2.18504671e+02
1716.lowfreq: -5.7424 -0.0008 0.0008 0.0012 3.2330 7.9539 23.0807 29.3075 36.7403
frequency: 22.7958 29.2221 36.5945 51.9615 63.2800 86.4062 95.1482 110.1578 129.1977 160.7793 174.1187 191.2949 218.5205 223.4714 244.4581 246.0392 252.7326 259.8046 303.3656 311.1363 325.4937 338.9216 369.4008 387.7698 398.8622 446.3090 454.3581 466.8292 506.7410 525.6644 575.8858 583.6168 603.1539 630.8577 657.5042 672.3276 676.1507 715.2966 726.0861 753.1296 763.9209 773.1318 789.5008 811.1759 836.4128 855.2057 860.3847 869.0366 883.7750 897.3622 907.8957 920.2533 940.8042 950.5140 956.8995 985.3421 1002.0092 1005.9862 1038.8244 1041.9036 1051.7659 1062.7793 1084.1808 1104.5974 1111.8696 1113.2318 1121.5621 1133.0506 1137.6760 1144.0917 1165.5331 1172.6950 1174.0456 1187.2152 1190.1989 1200.7267 1213.6955 1234.0981 1241.9078 1247.0848 1251.5700 1256.7955 1270.9080 1295.3456 1320.9781 1328.9540 1344.9112 1371.1390 1383.7538 1417.8261 1423.8520 1433.6064 1434.3279 1436.4253 1455.3813 1462.3178 1467.6209 1469.2963 1470.6854 1475.1352 1481.6413 1484.7311 1494.3491 1572.1616 1585.6785 1603.9772 1608.8665 2805.0564 2876.6076 2893.6670 2908.2512 2959.1155 3004.6894 3010.2116 3041.4360 3046.3696 3046.7444 3051.7379 3073.1885 3074.2840 3111.0580 3115.0855 3125.3993 3137.5047 3141.7413 3143.7983 3160.1698 3167.9526 3443.6857
redmass: 4.2089 3.0381 4.2622 4.2208 3.7182 3.7661 3.5944 3.3804 3.3451 3.0941 4.3403 1.3472 2.5970 3.4287 1.8442 3.4584 2.0871 4.1327 3.4073 3.5856 5.2214 6.6744 5.5312 4.0260 2.2989 2.8123 2.8853 3.2825 4.0132 4.1102 4.7446 4.5602 5.8200 5.5448 3.8847 2.4831 3.0707 3.3486 3.6118 1.7808 4.4905 3.5080 2.7965 1.4304 2.0518 2.4297 1.6152 1.9576 3.0675 1.7717 2.0085 4.4405 1.3578 1.5206 2.3614 1.3351 2.0964 3.9568 4.9732 1.5668 2.9159 3.3612 1.0649 2.1537 1.4262 1.2600 1.3292 1.6603 2.5791 1.5992 1.8082 2.2629 1.4273 1.2502 2.1418 1.7256 1.5485 1.8052 2.1073 1.4087 1.5362 1.7320 1.4194 1.5065 1.3273 1.3680 2.0193 5.9575 3.1302 2.6533 1.3153 1.6727 1.1415 1.2906 1.1336 1.1050 1.0533 1.8710 1.1401 1.1756 1.1141 2.3057 1.0484 6.8607 6.6687 6.1582 6.6306 1.0802 1.0555 1.0659 1.0688 1.0330 1.0599 1.0760 1.0941 1.1035 1.0909 1.0941 1.0989 1.1027 1.0864 1.0891 1.0993 1.0921 1.0888 1.0906 1.1007 1.0953 1.0746
irintensity: 0.3905 1.0961 0.2180 0.5273 0.6723 4.4226 4.2471 0.8394 2.4283 0.5447 1.3223 2.9940 0.6304 0.9301 0.8547 0.2882 1.8226 4.8470 3.5284 3.7158 1.8234 0.4069 1.3823 0.9080 1.3228 2.0659 1.1756 5.3048 4.6272 2.9597 9.7528 10.2109 15.3453 3.0911 20.0545 39.3469 66.6340 20.3206 0.3615 43.7050 1.2623 16.4082 12.0559 41.7170 8.2721 1.7679 2.1714 3.6956 6.8530 23.0577 8.2743 2.2049 0.8570 7.4980 14.2246 0.0405 17.3772 50.2381 12.9352 8.9483 22.6987 8.9952 1.8304 11.6111 2.4455 0.2193 5.1269 18.0071 10.8020 32.2223 30.0602 45.6259 11.8564 6.6361 32.2942 4.5424 2.5868 51.4659 11.2872 4.6969 67.8410 84.8507 12.3670 16.9981 6.0770 21.2539 2.4216 3.1428 4.3446 28.4983 3.4323 11.7028 2.3092 11.3966 27.6154 21.9192 13.9652 131.1516 0.1324 1.9541 9.7580 32.0967 18.6602 33.8612 2.5737 5.0500 65.5211 68.6466 98.4483 101.0699 80.6739 78.8163 18.2677 66.7543 34.8318 34.5115 57.2568 34.9861 35.0480 7.6772 16.0070 1.7915 25.9272 24.7023 6.1375 1.0414 37.6303 15.6692 0.4210
temp: 298.150 k
press: 1.00000 atm
elementType: 16 8 7 7 6 6 6 6 6 6 6 6 6 6 6 6 6 6 6 6 6 6 6 1 1 1 1 1 1 1 1 1 1 1 1 1 1 1 1 1 1 1 1 1 1
symmnumber: 1
zpe: 963874.2 jmol-1
zpe.correction: 0.367120 hartree
zpe.thermalcorrener: 0.388728 hartree
zpe.thermalcorrenthalpy: 0.389672 hartree
zpe.thermalcorrgfe: 0.315316 hartree
zpe.sumelectzpe: -1318.247537 hartree
zpe.sumelectthermal: -1318.225929 hartree
zpe.sumelectthermalent: -1318.224985 hartree
zpe.sumelectthermalfe: -1318.299341 hartree
dipole: -1.2745 -1.2065 -0.8396
dipole: 1.9455
quadrupole: -115.3968 -146.1831 -139.3755
quadrupole: -5.6991 -4.8278 -4.6429
quadrupole: 18.2550 -12.5313 -5.7237 -5.6991 -4.8278 -4.6429
hfenergy: -1318.6146576 hartree
pointgroup: C01 [X(C19H22N2O1S1)]
dipole: -0.4557573 0.4912857 0.3698238 debye
polarizability: 295.6851426|29.8099312|202.9895521|0.0360139|-0.4836409|218.5471284 unknown
InChI: InChI=1S/C19H22N2OS/c1-20-14-10-21(11-14)19-16-6-4-3-5-13(16)12-23-18-8-7-15(22-2)9-17(18)19/h3-9,14,19-20H,10-12H2,1-2H3
charge 0 multiplicity 1
45 atoms
S  0.002706 0.32063 -2.46635
O  -4.596062 0.075945 1.47744
N  0.890823 -1.200658 0.239527
N  2.0493 -3.762445 -0.7927
C  1.650314 -3.181444 0.489656
C  0.227513 -2.537121 0.435456
C  2.178093 -1.718416 0.8194
C  0.248948 0.028316 0.767721
C  1.239134 1.203774 0.648585
C  -1.147199 0.153665 0.140498
C  1.506239 1.968443 -0.528515
C  -1.38082 0.173791 -1.26567
C  2.012287 1.465937 1.811019
C  -2.262901 0.12953 1.003381
C  0.674409 1.962094 -1.802263
C  3.433751 -4.265436 -0.852204
C  2.563791 2.918793 -0.497707
C  -2.699295 0.125742 -1.763601
C  -3.587113 0.095847 0.501244
C  3.042731 2.428452 1.836036
C  3.331227 3.155025 0.661735
C  -3.813715 0.072766 -0.895154
C  -5.983336 0.026734 1.010824
H  1.816778 -3.922138 1.28946
H  -0.431706 -2.859775 -0.388256
H  -0.314733 -2.629036 1.405968
H  2.277816 -1.555008 1.918975
H  3.09298 -1.369934 0.308845
H  0.067494 -0.090137 1.869789
H  1.825631 -3.12172 -1.566966
H  1.796268 0.892957 2.721349
H  -2.122545 0.117471 2.089751
H  -0.217473 2.602011 -1.674184
H  1.265473 2.375365 -2.637493
H  3.633138 -4.681487 -1.855615
H  3.55906 -5.086529 -0.121131
H  4.218889 -3.500671 -0.634511
H  2.777292 3.496621 -1.40603
H  -2.857472 0.148865 -2.846833
H  3.613722 2.601079 2.754786
H  4.136313 3.898017 0.64682
H  -4.823747 0.033046 -1.313078
H  -6.178007 -0.890799 0.421725
H  -6.235627 0.917775 0.403267
H  -6.594172 0.016562 1.925405
