program: Orca
programVersion: 6.0.x
elementType: C N O H H C H H H O H H C F F F
charge: 1
multiplicity: 1
keywords: wB97X-D3 def2-TZVPPD autoaux TightSCF
formula: C3H7F3NO2
InChI: InChI=1/C3H5F3NO.H2O/c4-3(5,6)1-2-7-8;/h2H,1,8H2;1H2
16 atoms
C  0.420115 -0.345029 -0.074407
N  1.399072 0.46708 -0.070825
O  2.467653 -0.110059 0.813246
H  3.386246 -0.074036 0.238399
H  2.544906 0.508514 1.562108
C  -0.77216 0.018309 -0.899958
H  -0.906544 -0.738169 -1.680293
H  -0.64852 0.99791 -1.365212
H  0.429104 -1.271953 0.500397
O  4.546503 -0.0107 -0.457822
H  4.688577 0.611307 -1.180985
H  5.159828 -0.749834 -0.543829
C  -2.032471 0.026269 -0.038165
F  -3.098873 0.329223 -0.772702
F  -1.922853 0.925676 0.952961
F  -2.229155 -1.178107 0.527351
totalener: -623.05168638758767 hartree
nucrepener: 492.63236066296236 hartree
electener: -1115.68409349700573 hartree
oneelecener: -1825.04270866089291 hartree
twoeener: 709.35861516388718 hartree
kineticenergy: 620.71075228979703 hartree
xcener: -52.022149113638 hartree
energy: -678.8107 -678.7945 -678.7629 -531.8534 -529.9565 -399.9088 -290.2925 -286.8044 -285.0329 -42.5365 -40.0916 -40.0438 -39.4599 -37.2506 -33.4150 -29.2171 -25.6303 -25.1878 -24.2088 -23.8514 -23.4571 -22.6595 -22.5620 -21.8342 -21.2621 -20.0600 -19.4291 -19.1561 -18.9036 -18.5590 -17.9877 -17.8506 -17.8341 -17.4742 -17.3643 -16.5871 -16.4588 -3.7398 -3.0510 -2.3700 -1.8502 -1.3074 -1.0987 -0.6011 -0.4166 -0.2931 -0.0207 0.3445 electronvolt
chargesum: 1.0000000
charge: 0.174375 -0.434795 -0.038442 0.417396 0.225634 -0.191280 0.191827 0.131469 0.269432 -0.240428 0.211323 0.207573 0.926464 -0.266890 -0.290671 -0.292986
charge: 0.029620 0.200424 0.435347 -0.220030 -0.044416 0.117219 0.058244 0.052218 0.063856 0.629762 -0.099789 -0.099778 -0.600275 0.175230 0.153728 0.148639
qa: 0.1744 -0.4348 -0.0384 0.4174 0.2256 -0.1913 0.1918 0.1315 0.2694 -0.2404 0.2113 0.2076 0.9265 -0.2669 -0.2907 -0.2930
va: 3.6920 2.2394 2.2372 0.8136 0.9959 4.2866 1.0379 1.0990 0.8577 2.1771 0.9922 0.9895 3.3280 0.9386 0.9104 0.9251
dispcorr: -0.004216137 hartree
energy: -623.055902524254
