program: Gaussian 09
title: 000052737
version: EM64L-G09RevD.01
frameworkgroup: C1[X(C17H25NO)]
method: RPBEPBE
basis: SDD
operation: Freq
keyword: #p
keyword: freq=noraman
keyword: PBEPBE/SDD
title: #p freq=noraman PBEPBE/SDD
converged: YES YES NO NO
title: Mulliken charges:
elementType: O N C C C C C C C C C C C C C C C C C H H H H H H H H H H H H H H H H H H H H H H H H H
charge: -0.292442 -0.347090 0.032423 -0.454375 -0.444916 -0.396068 -0.394965 -0.387037 0.364934 -0.201132 0.488788 -0.405201 -0.359222 -0.435947 -0.400011 -0.733667 -0.417953 -0.043514 -0.572220 0.186083 0.216276 0.207990 0.209230 0.231091 0.193145 0.205861 0.204491 0.192476 0.201426 0.192277 0.189542 0.246281 0.235064 0.230772 0.274029 0.255112 0.230860 0.203309 0.236210 0.186982 0.234714 0.201663 0.214540 0.220190
chargesum: 0.00000
title: Mulliken charges with hydrogens summed into heavy atoms:
elementType: O N C C C C C C C C C C C C C C C C C
charge: -0.292442 -0.091978 0.218506 -0.030109 -0.004595 0.002938 0.002002 0.006666 0.364934 -0.011589 0.488788 -0.158920 -0.124158 -0.205175 -0.125983 -0.063289 0.003743 0.158149 -0.137489
polarizability: 2.52276415e+02 1.38005173e+01 1.82403125e+02 -1.06611399e+01 1.11915261e+01 1.51464091e+02
1716.lowfreq: -10.1911 -6.1655 -0.0003 -0.0001 0.0006 7.1837 16.4020 22.8901 35.0479
frequency: 15.7426 22.5139 34.4659 53.6240 60.5709 70.0908 84.3015 130.3390 139.7607 166.1000 194.7754 215.0184 223.7396 230.7000 244.7587 302.7121 315.8722 322.5596 341.4905 401.0920 416.3710 425.5696 438.7650 458.2582 466.3541 496.4453 534.9790 554.2782 557.6471 620.7740 643.8484 650.7659 726.3989 735.1861 781.5899 785.7228 806.1064 824.9136 834.8647 847.2576 880.8235 895.7991 916.6068 921.7078 934.0558 944.8705 948.0692 953.0795 959.1588 974.9036 990.9549 1004.0680 1007.2980 1011.5516 1045.0200 1052.8294 1074.6626 1078.8387 1090.9601 1109.8882 1113.8824 1141.0198 1148.6947 1151.1994 1170.5621 1196.7851 1210.3915 1220.9680 1225.1144 1240.3709 1252.4495 1257.0957 1280.7043 1291.0822 1296.2745 1299.8803 1310.2918 1325.1533 1331.5015 1337.5398 1339.4679 1341.5225 1349.3864 1363.1776 1379.7933 1388.0657 1416.3613 1429.4685 1451.4451 1461.7419 1462.8908 1463.3378 1470.0093 1470.9945 1473.8632 1479.4452 1484.8122 1496.7323 1582.9654 1620.6544 1665.3115 2824.4021 2829.8452 2955.5694 2966.7320 2969.0697 2971.4363 2973.4507 2987.2422 2992.8234 3024.3810 3033.2786 3033.9644 3042.7118 3052.2053 3061.2026 3067.3676 3069.4500 3092.5053 3096.7921 3111.8062 3131.9901 3156.3620 3161.0652 3196.2285 3438.6667
redmass: 3.8262 3.3025 2.9848 2.6935 3.6896 3.2961 3.3258 3.3946 3.0463 2.6678 3.1610 1.7391 2.0325 2.8352 1.6321 3.8174 2.4472 2.2766 3.7525 3.1631 3.0207 2.5982 2.9620 2.3401 2.4058 2.2418 2.4380 2.2578 2.6421 3.8342 2.4268 1.8125 3.2554 3.6299 1.5108 2.2846 4.5485 1.3191 1.5476 1.9959 1.7358 1.5573 1.8054 1.7949 1.4938 1.4140 3.1700 1.4105 1.6117 1.3364 2.1312 2.4451 1.1659 3.1898 1.8801 1.0831 2.4433 1.3349 1.8206 2.3051 1.6869 3.1634 2.2770 1.8925 1.2508 1.5333 2.5445 1.2527 2.4237 1.3134 1.2757 1.3131 1.3003 1.3151 1.2677 1.2010 1.3176 1.6998 1.3635 1.4785 1.4643 1.3740 1.4832 1.4972 1.2118 3.1387 3.3033 1.1942 1.1892 1.0855 1.0906 1.0916 1.0772 1.0833 1.1442 1.0967 1.0841 2.3362 7.0780 6.5205 4.8627 1.0733 1.0788 1.0826 1.0645 1.0660 1.0608 1.0376 1.0615 1.0622 1.0861 1.0959 1.0965 1.1009 1.1023 1.1028 1.0812 1.0968 1.0715 1.1000 1.0891 1.0880 1.0944 1.0948 1.1148 1.0746
irintensity: 0.3564 0.1667 0.7254 0.1292 0.1778 0.3354 0.5086 0.6048 1.3398 2.4591 2.2476 0.1134 0.8155 1.4481 1.4428 1.2163 0.8220 1.6942 1.8679 2.2387 0.1937 1.7338 0.9627 6.1604 9.0118 1.3085 37.1639 7.5555 17.5997 12.0001 29.3004 19.6180 10.2189 2.6389 1.1212 1.4629 5.3139 10.3336 58.9607 13.9635 4.1503 11.2237 0.3807 0.1923 1.8539 69.5497 42.1235 2.7150 19.5580 2.3594 17.8243 1.4792 20.1143 99.3278 3.5573 0.0164 8.1779 2.0210 19.7551 1.1175 5.9418 61.9428 6.0737 18.8649 72.8637 4.0290 194.2706 17.9475 79.6282 0.5935 2.0539 13.2461 6.4200 2.6422 12.9270 3.2836 0.3038 31.8971 2.5594 7.8960 0.8082 1.4912 6.3041 17.9536 19.4082 25.2689 3.4119 2.2095 35.6456 1.1961 3.6371 14.0939 7.0856 20.7500 17.4088 7.4423 3.5078 143.8163 13.4570 61.6998 11.2633 45.5830 138.7328 12.8890 29.2967 43.5343 38.2708 46.7820 11.3805 31.2224 13.7454 64.5857 75.0282 41.3404 24.2287 78.7654 29.9773 57.1898 7.7292 21.1303 20.9415 5.5215 20.9893 7.7552 32.9319 4.0885
temp: 298.150 k
press: 1.00000 atm
elementType: 8 7 6 6 6 6 6 6 6 6 6 6 6 6 6 6 6 6 6 1 1 1 1 1 1 1 1 1 1 1 1 1 1 1 1 1 1 1 1 1 1 1 1 1
symmnumber: 1
zpe: 1002497.1 jmol-1
zpe.correction: 0.381831 hartree
zpe.thermalcorrener: 0.401462 hartree
zpe.thermalcorrenthalpy: 0.402406 hartree
zpe.thermalcorrgfe: 0.331225 hartree
zpe.sumelectzpe: -791.287850 hartree
zpe.sumelectthermal: -791.268219 hartree
zpe.sumelectthermalent: -791.267275 hartree
zpe.sumelectthermalfe: -791.338457 hartree
dipole: 0.0843 0.5496 0.6801
dipole: 0.8785
quadrupole: -96.8526 -113.9620 -118.2552
quadrupole: 6.6406 1.1843 1.0773
quadrupole: 12.8373 -4.2721 -8.5653 6.6406 1.1843 1.0773
hfenergy: -791.6696815 hartree
pointgroup: C01 [X(C17H25N1O1)]
dipole: -0.0478153 0.1847761 -0.2881523 debye
polarizability: 253.2618849|-11.3530453|178.3815539|-10.189824|-14.4407494|154.5001916 unknown
InChI: InChI=1S/C17H25NO/c1-3-13-18-14(2)15-9-11-17(12-10-15)19-16-7-5-4-6-8-16/h3,9-12,14,16,18H,1,4-8,13H2,2H3
charge 0 multiplicity 1
44 atoms
O  -2.098539 -0.687255 1.145381
N  4.094223 0.29577 -0.606462
C  -3.063549 0.148861 0.388963
C  -4.249456 0.383208 1.337966
C  -3.513218 -0.552194 -0.910275
C  -5.356405 1.20854 0.63701
C  -4.615016 0.274513 -1.620601
C  -5.81585 0.535383 -0.679242
C  -0.745496 -0.699049 0.766422
C  3.542328 -0.982435 -0.098233
C  2.050386 -0.84922 0.228367
C  0.094653 -1.511673 1.568695
C  -0.185746 0.040483 -0.307684
C  1.475113 -1.578725 1.29945
C  1.201029 -0.04266 -0.563693
C  3.774014 -2.081601 -1.164369
C  4.210665 1.375884 0.404364
C  4.956338 2.572477 -0.145481
C  4.491788 3.845694 -0.151842
H  -2.589186 1.126033 0.152007
H  -3.893777 0.8937 2.251806
H  -4.649835 -0.60208 1.647578
H  -3.909947 -1.550637 -0.639548
H  -2.6530 -0.716325 -1.585199
H  -4.972492 2.225345 0.411866
H  -6.214479 1.338213 1.323501
H  -4.947376 -0.256006 -2.533122
H  -4.193503 1.246064 -1.953695
H  -6.570796 1.165364 -1.187935
H  -6.307477 -0.43046 -0.442064
H  4.061858 -1.303604 0.842797
H  -0.354085 -2.066104 2.398877
H  -0.807782 0.679413 -0.9416
H  2.115869 -2.203014 1.93577
H  1.650989 0.5355 -1.379113
H  4.977859 0.14998 -1.113721
H  3.347117 -3.042588 -0.830228
H  4.855153 -2.23101 -1.353987
H  3.285738 -1.795667 -2.11295
H  4.73894 1.015412 1.326903
H  3.195079 1.675333 0.721857
H  5.962605 2.368007 -0.547867
H  5.092377 4.675545 -0.541536
H  3.49549 4.093983 0.234265
