program: Orca
programVersion: 6.0.x
elementType: C N O H H C H H H C H H F
charge: 1
multiplicity: 1
keywords: wB97X-D3 def2-TZVPPD autoaux TightSCF
formula: C3H7FNO
InChI: InChI=1/C3H7FNO/c4-2-1-3-5-6/h3H,1-2,6H2
13 atoms
C  0.678325 -0.376942 -0.019451
N  1.582672 0.423452 -0.409568
O  2.936251 -0.044818 0.302073
H  3.558218 -0.232245 -0.427882
H  3.265484 0.746005 0.771896
C  -0.689574 -0.152582 -0.578628
H  -0.942034 -1.051907 -1.15513
H  -0.700578 0.704904 -1.255547
H  0.873162 -1.192117 0.67926
C  -1.734099 0.023368 0.534945
H  -1.727481 -0.82014 1.233192
H  -1.58142 0.958969 1.080346
F  -2.964669 0.071734 -0.074074
totalener: -348.02463826248226 hartree
nucrepener: 234.44836594370827 hartree
electener: -582.47298223167422 hartree
oneelecener: -930.82517841953540 hartree
twoeener: 348.35219618786113 hartree
kineticenergy: 346.56471028676134 hartree
xcener: -30.910864352096 hartree
energy: -677.7679 -533.2149 -400.9303 -287.5223 -286.0757 -285.1674 -40.4494 -39.5038 -34.4941 -29.3579 -26.2054 -25.7310 -24.2877 -23.8836 -21.9118 -20.7857 -20.4813 -19.8630 -19.0131 -18.4442 -17.6957 -17.6737 -16.0325 -15.8585 -4.8106 -4.3608 -3.2053 -1.8657 -1.6134 -1.1859 -0.7005 -0.6366 -0.3270 0.0204 0.4513 electronvolt
chargesum: 1.0000000
charge: 0.223541 -0.335325 0.015319 0.274758 0.272248 0.040855 0.169281 0.114432 0.242027 -0.130873 0.205591 0.198902 -0.290758
charge: 0.016042 0.248999 0.530860 -0.031326 -0.031594 0.049661 0.051455 0.041779 0.066728 -0.046856 0.041506 0.043404 0.019342
qa: 0.2235 -0.3353 0.0153 0.2748 0.2722 0.0409 0.1693 0.1144 0.2420 -0.1309 0.2056 0.1989 -0.2908
va: 3.7320 2.1702 2.5057 0.9366 0.9419 3.7453 1.0398 1.0875 0.8982 3.7126 1.0311 1.0505 0.9046
dispcorr: -0.002603816 hartree
energy: -348.027242078434
