program: Orca
programVersion: 6.0.x
elementType: C N O H H C H H C H H C F F F C H H H
charge: 1
multiplicity: 1
keywords: wB97X-D3 def2-TZVPPD autoaux TightSCF
formula: C5H9F3NO
InChI: InChI=1/C5H9F3NO/c1-2-4(9-10)3-5(6,7)8/h2-3,10H2,1H3
19 atoms
C  0.289365 0.973096 0.011513
N  1.534308 1.103253 0.252034
O  2.327822 -0.067502 -0.421456
H  3.258449 0.162089 -0.248585
H  2.091291 -0.917787 0.02227
C  -0.532041 2.093912 0.598209
H  -1.33007 1.625274 1.18535
H  0.089339 2.678219 1.280319
C  -0.380667 -0.13663 -0.761192
H  -1.383144 0.178916 -1.055401
H  0.179352 -0.385142 -1.666753
C  -0.537042 -1.400741 0.077279
F  -1.133553 -2.359943 -0.605952
F  -1.201549 -1.174429 1.205984
F  0.705385 -1.885776 0.451526
C  -1.11546 2.993935 -0.501635
H  -1.772899 2.450518 -1.185512
H  -1.710029 3.77864 -0.030532
H  -0.32178 3.471866 -1.080396
totalener: -625.22144999052080 hartree
nucrepener: 611.82602429193173 hartree
electener: -1237.04747362327180 hartree
oneelecener: -2059.91416071525055 hartree
twoeener: 822.86668709197863 hartree
kineticenergy: 622.71400603595237 hartree
xcener: -53.858534328644 hartree
energy: -680.3128 -679.9245 -679.8958 -532.6594 -400.3270 -291.5015 -287.2915 -285.8795 -284.7879 -283.6878 -43.7367 -41.3471 -41.2764 -39.9811 -34.1158 -30.1267 -28.8844 -26.7343 -25.7662 -25.4752 -24.0280 -23.8282 -23.5861 -23.4175 -21.5808 -21.5336 -20.5696 -20.4132 -20.1453 -19.7098 -19.2306 -19.1753 -18.7245 -18.6309 -18.3062 -17.7247 -17.3506 -16.6578 -16.5459 -16.4172 -3.9648 -3.9214 -2.4386 -1.5111 -1.1731 -0.9984 -0.7000 -0.5146 -0.3895 -0.0849 0.0757 electronvolt
chargesum: 1.0000000
charge: 0.615800 -0.477784 -0.004540 0.245886 0.307816 0.035583 0.193584 0.144222 -0.285428 0.124146 0.224837 0.994725 -0.273194 -0.289076 -0.364867 -0.808189 0.211365 0.201464 0.203650
charge: -0.188820 0.279900 0.531388 -0.028100 -0.101358 0.015362 0.041135 0.033916 0.156873 0.052723 0.059333 -0.549377 0.201419 0.187601 0.126387 0.177405 -0.006997 0.005540 0.005670
qa: 0.6158 -0.4778 -0.0045 0.2459 0.3078 0.0356 0.1936 0.1442 -0.2854 0.1241 0.2248 0.9947 -0.2732 -0.2891 -0.3649 -0.8082 0.2114 0.2015 0.2037
va: 3.2564 1.7410 2.5388 0.8795 0.9574 3.3059 0.9934 1.0831 4.6378 1.1372 1.0324 3.0073 0.9259 0.9155 0.8639 3.9277 1.0093 1.0896 1.0572
dispcorr: -0.006677420 hartree
energy: -625.228127410220
