program: Orca
programVersion: 6.0.x
elementType: C N O H H C H H H O H H C H H C F F F
charge: 1
multiplicity: 1
keywords: wB97X-D3 def2-TZVPPD autoaux TightSCF
formula: C4H9F3NO2
InChI: InChI=1/C4H7F3NO.H2O/c1-3(8-9)2-4(5,6)7;/h2,9H2,1H3;1H2
19 atoms
C  -0.220954 1.034154 -0.287199
N  1.003862 0.761488 -0.036945
O  1.277535 -0.690969 -0.182349
H  2.336819 -0.773213 -0.038774
H  0.777366 -1.184945 0.503412
C  -0.577248 2.481553 -0.170226
H  -0.960014 2.837852 -1.131745
H  -1.37487 2.596005 0.570404
H  0.283561 3.081297 0.124446
O  3.690352 -0.852043 0.187446
H  4.160697 -0.077828 0.519024
H  4.27895 -1.34697 -0.394363
C  -1.292115 0.039114 -0.671275
H  -2.118169 0.561776 -1.157518
H  -0.903191 -0.710817 -1.365043
C  -1.869304 -0.683965 0.537942
F  -2.800971 -1.554702 0.183075
F  -2.374532 0.16036 1.435692
F  -0.880228 -1.393865 1.187618
totalener: -662.38693895326594 hartree
nucrepener: 617.65828459581064 hartree
electener: -1280.04526119856700 hartree
oneelecener: -2125.13889807538681 hartree
twoeener: 845.09363687681969 hartree
kineticenergy: 659.80368044418071 hartree
xcener: -56.206033795136 hartree
energy: -679.7676 -679.4436 -679.4132 -531.3792 -529.5139 -399.3715 -290.9696 -286.6437 -285.2718 -284.0858 -43.2289 -40.8207 -40.7713 -39.0709 -36.8166 -33.0546 -29.5158 -27.6430 -25.9857 -24.9308 -23.6984 -23.4709 -23.3820 -23.3131 -22.9034 -20.9997 -20.8961 -20.3242 -19.9067 -19.6670 -19.0665 -19.0630 -18.6554 -18.4390 -18.1850 -17.9618 -17.7311 -17.5261 -17.2921 -16.2455 -15.7349 -3.2980 -2.5628 -1.8861 -1.4044 -0.9814 -0.7607 -0.4607 -0.3571 -0.2006 -0.0361 0.1960 electronvolt
chargesum: 1.0000000
charge: 0.654158 -0.491606 -0.061036 0.454705 0.253811 -0.696009 0.197128 0.198085 0.190033 -0.243867 0.204056 0.192066 -0.274345 0.181543 0.221211 0.957611 -0.280045 -0.297759 -0.359740
charge: -0.211019 0.221246 0.439720 -0.216347 -0.104750 0.218032 0.020682 0.017860 0.010949 0.619743 -0.105034 -0.105329 0.145743 0.057991 0.053590 -0.556203 0.191136 0.178531 0.123459
qa: 0.6542 -0.4916 -0.0610 0.4547 0.2538 -0.6960 0.1971 0.1981 0.1900 -0.2439 0.2041 0.1921 -0.2743 0.1815 0.2212 0.9576 -0.2800 -0.2978 -0.3597
va: 3.1285 2.0037 2.2547 0.6737 1.0422 3.8531 1.0370 1.0198 1.0686 2.1709 1.0065 1.0023 4.5665 1.0484 1.0214 3.1123 0.9313 0.9172 0.8502
dispcorr: -0.006280458 hartree
energy: -662.393219411743
