program: Orca
programVersion: 6.0.x
elementType: C N O H H C H H H C H H C H H F
charge: 1
multiplicity: 1
keywords: wB97X-D3 def2-TZVPPD autoaux TightSCF
formula: C4H9FNO
InChI: InChI=1/C4H9FNO/c1-4(6-7)2-3-5/h2-3,7H2,1H3
16 atoms
C  0.695247 0.514403 -0.089045
N  1.894833 0.153481 0.145954
O  1.983824 -1.46685 0.054515
H  2.63513 -1.633554 -0.651953
H  2.39969 -1.724176 0.898256
C  0.59047 2.017847 -0.006725
H  0.135214 2.385401 -0.930584
H  -0.060049 2.279549 0.83309
H  1.56288 2.489687 0.136284
C  -0.505529 -0.308157 -0.439829
H  -0.690519 -0.149694 -1.510211
H  -0.320003 -1.370793 -0.286396
C  -1.764935 0.100048 0.337272
H  -2.085682 1.117786 0.099909
H  -1.620712 -0.000877 1.417527
F  -2.764079 -0.765294 -0.046789
totalener: -387.35692538781694 hartree
nucrepener: 315.18632509840006 hartree
electener: -702.54325671675508 hartree
oneelecener: -1142.99537798100596 hartree
twoeener: 440.45212126425088 hartree
kineticenergy: 385.66530277442331 hartree
xcener: -35.090062654033 hartree
energy: -677.7937 -532.6348 -400.3699 -287.3604 -286.0589 -285.0952 -284.8534 -39.8532 -39.5155 -34.1772 -29.4778 -27.9181 -25.7076 -25.2897 -23.8255 -22.1417 -21.7272 -20.9063 -20.1089 -19.7554 -19.4648 -18.7532 -18.2769 -17.9124 -17.2413 -16.9683 -16.0084 -15.8669 -4.5378 -3.7357 -2.9127 -1.6786 -1.5064 -1.0530 -0.7394 -0.6031 -0.4389 -0.0401 0.2219 electronvolt
chargesum: 1.0000000
charge: 0.783860 -0.510999 -0.006485 0.257022 0.256709 -0.727110 0.218473 0.197706 0.200878 0.043708 0.221950 0.149588 -0.145010 0.178648 0.203779 -0.322718
charge: -0.219916 0.267005 0.523145 -0.037697 -0.038029 0.227724 0.027943 0.020017 0.013631 0.072252 0.058628 0.024684 -0.042530 0.037812 0.046921 0.018411
qa: 0.7839 -0.5110 -0.0065 0.2570 0.2567 -0.7271 0.2185 0.1977 0.2009 0.0437 0.2220 0.1496 -0.1450 0.1786 0.2038 -0.3227
va: 2.8392 1.7129 2.4764 0.9592 0.9558 3.8886 1.0126 1.0212 1.0632 3.5668 0.9993 1.1021 3.6991 1.0297 0.9899 0.8386
dispcorr: -0.004354526 hartree
energy: -387.361279913825
