program: Gaussian 09
title: 000052740
version: EM64L-G09RevD.01
frameworkgroup: C1[X(C21H25N)]
method: RPBEPBE
basis: SDD
operation: Freq
keyword: #pfreq=noraman
keyword: PBEPBE/SDD
title: #p freq=noraman PBEPBE/SDD
converged: YES YES NO NO
title: Mulliken charges:
elementType: N C C C C C C C C C C C C C C C C C C C C C H H H H H H H H H H H H H H H H H H H H H H H H H
charge: -0.106637 0.156120 0.036244 -0.547881 -0.622016 -0.485412 0.162808 0.188313 0.286272 0.339592 -0.348390 -0.763578 -0.401296 -0.391590 -0.367252 -0.442197 -0.633600 -0.624666 -0.256240 -0.257974 -0.256171 -0.236953 0.169006 0.219121 0.237246 0.212020 0.221730 0.251845 0.198222 0.239145 0.222977 0.235931 0.223988 0.250218 0.242730 0.230387 0.235568 0.247122 0.184599 0.216046 0.220304 0.186349 0.223260 0.226463 0.226988 0.226741 0.224497
chargesum: 0.00000
title: Mulliken charges with hydrogens summed into heavy atoms:
elementType: N C C C C C C C C C C C C C C C C C C C C C
charge: -0.106637 0.156120 0.205250 -0.091514 -0.188265 -0.035345 0.162808 0.188313 0.286272 0.339592 -0.109245 -0.080682 -0.151078 -0.148861 -0.136864 -0.206629 0.014167 0.005247 -0.029777 -0.030986 -0.029430 -0.012456
polarizability: 2.63545656e+02 -1.26244658e+01 2.47534840e+02 2.54310387e+01 1.21552330e+01 1.90587598e+02
1716.lowfreq: -9.9884 -5.4131 -0.0005 -0.0002 0.0004 7.4841 12.5460 32.6801 40.2033
frequency: 8.6404 32.6753 40.1862 43.3343 53.5716 95.6965 99.5491 141.9882 160.9024 172.0584 182.7459 195.9982 230.3396 255.1856 260.9509 274.5400 298.2865 312.8869 330.7059 349.6170 369.6573 413.5740 417.7045 430.2260 445.5585 458.1797 466.4799 481.0068 503.1899 531.1517 540.0242 584.9375 595.2115 629.4969 656.5083 680.8409 719.9272 742.0798 759.8394 762.3405 772.6902 775.3768 792.0338 832.6526 863.7896 876.1337 882.0342 901.4794 911.1365 924.3067 947.1303 952.1178 970.3131 971.6330 983.9982 986.2609 1026.1279 1028.9217 1031.3741 1040.0681 1056.2024 1073.5562 1083.3573 1092.1042 1106.3030 1107.8305 1119.8185 1135.2500 1162.6847 1165.1774 1172.8177 1174.2193 1193.5686 1211.0380 1213.5069 1218.1720 1224.7811 1243.6538 1255.4854 1268.0264 1285.9333 1292.3880 1324.2892 1329.4261 1341.2375 1351.3256 1358.0380 1375.3596 1376.9735 1381.4017 1417.0852 1427.6889 1439.1666 1442.1810 1447.6326 1451.1652 1464.6689 1466.8797 1468.0111 1475.9010 1478.9390 1480.6915 1483.1034 1483.7308 1495.4816 1576.1915 1582.8476 1603.2468 1609.5687 1632.9876 2798.6604 2840.3447 2856.0194 2960.0250 2977.3085 2981.5515 2984.0940 3012.3479 3029.3054 3032.0657 3043.3811 3056.1917 3075.4926 3079.7452 3087.0574 3089.2397 3097.8379 3107.6509 3114.5746 3125.8801 3126.2314 3139.9372 3141.4196 3159.4748 3160.2713
redmass: 2.6868 3.8178 3.2471 4.0583 3.3038 3.6348 3.7428 2.9445 3.6420 2.4055 2.7452 1.4886 1.1910 2.9388 1.9885 1.7980 2.7436 3.3798 4.1654 2.7433 1.8748 2.4446 3.1594 2.7069 2.5888 3.0299 2.8968 3.3551 2.9117 4.1092 3.7401 3.0808 3.7892 5.2525 4.8107 4.9851 3.0993 2.0442 2.8968 1.6113 2.8169 1.7223 3.0717 1.7882 1.5383 1.9014 1.5505 1.7053 1.8208 2.4343 1.5116 1.4032 2.0706 2.1943 1.3255 1.3188 1.8005 1.9040 2.7988 2.1171 2.2434 1.9321 1.5192 1.8945 2.0597 2.0652 2.0873 1.5464 1.3802 1.6768 1.0668 1.1195 1.9249 2.7062 1.4162 1.7539 1.4437 1.7370 1.9309 1.4690 1.4067 1.5200 1.5510 1.5010 1.3260 2.0466 1.8122 2.8409 5.9408 1.2434 1.1361 2.2433 2.2553 1.1551 1.1742 1.0969 1.0594 1.0555 1.1195 1.0595 1.0615 2.3362 1.7684 1.2861 1.0510 6.5516 6.7630 6.1255 6.4649 8.2339 1.0805 1.0580 1.0583 1.0610 1.0632 1.0628 1.0372 1.0964 1.0731 1.0722 1.1008 1.0929 1.0903 1.0985 1.0990 1.0993 1.0978 1.0876 1.0868 1.0877 1.0868 1.0939 1.0932 1.1007 1.1008
irintensity: 0.4327 0.1161 0.1362 0.0158 0.4694 0.0640 0.3942 0.7184 1.9083 0.5670 0.9786 0.8983 0.8757 1.5572 0.5871 3.8627 5.6943 1.4039 0.1710 1.9120 0.3537 1.6264 0.7324 3.9467 1.3911 1.5808 0.2301 2.8805 6.6789 2.7418 3.1032 2.9142 13.4250 8.5914 0.9970 1.7644 2.1630 19.4426 27.0961 32.0320 1.9015 75.5976 3.5126 9.7861 1.0522 1.2847 0.2573 20.4763 6.3896 1.3944 0.6869 4.5505 17.3852 4.3807 0.1039 0.0958 6.3527 14.8449 5.7037 1.3007 4.2755 24.5724 9.0544 24.8574 7.3280 0.6803 24.1182 7.6114 1.5214 3.8884 0.7106 0.5049 0.1361 11.4959 5.3937 1.2517 2.1087 6.9500 5.3668 8.8028 3.4508 0.9879 0.5606 8.4695 36.7740 0.5236 4.4344 9.1915 1.3205 16.6003 3.0051 9.2103 1.9092 14.4651 11.9775 2.2367 18.9603 2.8510 8.6113 1.7136 35.9079 11.1339 25.1493 6.4913 16.7680 1.6760 0.6466 1.0713 1.1933 1.8319 68.2478 67.7876 231.7770 26.3820 22.2792 16.9518 17.4321 41.8022 19.3623 72.3397 32.1192 4.1044 18.6859 34.1093 21.4888 89.8721 21.8113 13.2206 8.0394 3.4405 4.2681 25.2950 30.2554 41.0709 26.9918
temp: 298.150 k
press: 1.00000 atm
elementType: 7 6 6 6 6 6 6 6 6 6 6 6 6 6 6 6 6 6 6 6 6 6 1 1 1 1 1 1 1 1 1 1 1 1 1 1 1 1 1 1 1 1 1 1 1 1 1
symmnumber: 1
zpe: 1052083.2 jmol-1
zpe.correction: 0.400717 hartree
zpe.thermalcorrener: 0.421476 hartree
zpe.thermalcorrenthalpy: 0.422420 hartree
zpe.thermalcorrgfe: 0.349413 hartree
zpe.sumelectzpe: -868.350744 hartree
zpe.sumelectthermal: -868.329985 hartree
zpe.sumelectthermalent: -868.329041 hartree
zpe.sumelectthermalfe: -868.402049 hartree
dipole: -0.3722 -0.5608 0.6923
dipole: 0.9656
quadrupole: -125.5779 -126.1715 -126.7215
quadrupole: 4.0331 5.5515 3.6639
quadrupole: 0.5790 -0.0145 -0.5645 4.0331 5.5515 3.6639
hfenergy: -868.7514617 hartree
pointgroup: C01 [X(C21H25N1)]
dipole: 0.116382 -0.2710929 -0.2393371 debye
polarizability: 266.6520195|13.1509458|239.7190698|21.8128302|-21.8429114|195.2970039 unknown
InChI: InChI=1S/C21H25N/c1-16(22(2)3)12-15-21-19-10-6-4-8-17(19)13-14-18-9-5-7-11-20(18)21/h4-11,15-16H,12-14H2,1-3H3
charge 0 multiplicity 1
47 atoms
N  4.522209 -1.102775 0.059332
C  -0.398904 -0.209168 0.404757
C  3.087294 -1.352492 -0.286091
C  -2.704552 0.579596 -1.654716
C  -1.302915 1.138153 -2.003279
C  2.153975 -0.558035 0.681615
C  -1.764248 -0.842992 0.362193
C  -0.301215 1.285971 0.31791
C  -2.803672 -0.482465 -0.553552
C  -0.722342 1.956188 -0.865544
C  0.7105 -0.996469 0.578119
C  2.758927 -0.94956 -1.73979
C  -2.036443 -1.861128 1.325744
C  0.211311 2.044555 1.400414
C  -4.049758 -1.161298 -0.468415
C  -0.617787 3.365312 -0.940786
C  5.484596 -1.484088 -0.999114
C  4.916423 -1.726327 1.342797
C  -3.276648 -2.523394 1.391942
C  0.306736 3.451817 1.319459
C  -4.299401 -2.168902 0.483168
C  -0.107582 4.116356 0.143029
H  2.854968 -2.447378 -0.169144
H  -3.148748 0.15107 -2.575355
H  -3.35446 1.434254 -1.373342
H  -1.39386 1.765152 -2.909781
H  -0.627388 0.296824 -2.25496
H  2.270607 0.519775 0.472899
H  2.493119 -0.716388 1.72508
H  0.554553 -2.086579 0.615963
H  3.245061 -1.603505 -2.483619
H  1.667516 -1.016602 -1.894886
H  3.068111 0.095798 -1.925365
H  -1.257128 -2.105204 2.055908
H  0.522543 1.524694 2.313636
H  -4.840227 -0.887038 -1.179312
H  -0.934994 3.876633 -1.8582
H  5.306549 -0.903438 -1.917533
H  5.456453 -2.573353 -1.26118
H  6.506163 -1.248618 -0.649994
H  5.966916 -1.468885 1.566865
H  4.829473 -2.843913 1.331186
H  4.300588 -1.347231 2.174675
H  -3.448389 -3.293822 2.151864
H  0.701095 4.023387 2.167004
H  -5.275196 -2.665954 0.518635
H  -0.033429 5.207265 0.069966
