program: Orca
programVersion: 6.0.x
elementType: C N O H H C H H H H O H H
charge: 1
multiplicity: 1
keywords: wB97X-D3 def2-TZVPPD autoaux TightSCF
formula: C2H8NO2
InChI: InChI=1/C2H6NO.H2O/c1-2-3-4;/h2H,4H2,1H3;1H2
13 atoms
C  -1.307435 -0.420361 0.041074
N  -0.381247 0.422996 0.27478
O  0.773085 -0.329985 0.904305
H  1.612956 -0.170745 0.263905
H  0.937634 0.125952 1.74836
C  -2.563157 0.069383 -0.585857
H  -2.723816 -0.464273 -1.527647
H  -3.403603 -0.171484 0.072352
H  -2.532467 1.143638 -0.768788
H  -1.191226 -1.474861 0.29423
O  2.710215 0.048688 -0.55484
H  2.768648 0.784957 -1.174191
H  3.342994 -0.632323 -0.809383
totalener: -285.94710047290886 hartree
nucrepener: 183.52440333289516 hartree
electener: -469.47149646638240 hartree
oneelecener: -744.42742511715301 hartree
twoeener: 274.95592865077060 hartree
kineticenergy: 284.68890897163044 hartree
xcener: -25.975091396507 hartree
energy: -531.5954 -529.6449 -399.5065 -286.4105 -284.1411 -39.1474 -36.9321 -33.0226 -27.7842 -24.9285 -23.7321 -23.5294 -23.0025 -20.9486 -19.7689 -18.9154 -18.2970 -17.7301 -17.6697 -16.3375 -16.2571 -3.2587 -2.8834 -2.2555 -1.7615 -1.1574 -0.8988 -0.4689 -0.2467 -0.0633 0.2514 0.6361 electronvolt
chargesum: 1.0000000
charge: 0.416644 -0.445778 -0.025541 0.404862 0.224255 -0.516436 0.188491 0.188256 0.155684 0.250684 -0.252993 0.206467 0.205405
charge: -0.023906 0.182534 0.435750 -0.219016 -0.048613 0.189739 0.012651 0.013580 0.007409 0.051951 0.611463 -0.106635 -0.106906
qa: 0.4166 -0.4458 -0.0255 0.4049 0.2243 -0.5164 0.1885 0.1883 0.1557 0.2507 -0.2530 0.2065 0.2054
va: 3.3713 2.1882 2.2877 0.8400 0.9929 3.8609 1.0376 1.0410 1.0727 0.8773 2.1655 0.9967 0.9904
dispcorr: -0.002260000 hartree
energy: -285.949360473135
