program: Orca
programVersion: 6.0.x
elementType: C N O H H O H H C C C C H C H H H N H
charge: 1
multiplicity: 1
keywords: wB97X-D3 def2-TZVPPD autoaux TightSCF
formula: C6H9N2O2
InChI: InChI=1/C6H7N2O.H2O/c9-8-5-6-1-3-7-4-2-6;/h1-5H,9H2;1H2
19 atoms
C  -1.048461 1.192593 -0.897497
N  -0.805301 2.353993 -0.431172
O  0.019953 2.266444 0.809335
H  1.005228 1.848548 0.629239
H  0.060984 3.186603 1.115786
O  2.178649 1.216936 0.366388
H  3.042725 1.644622 0.337588
H  2.283945 0.297719 0.642801
C  -0.656529 -0.155701 -0.450074
C  -0.631833 -0.546582 0.894134
C  -0.318004 -1.092766 -1.428241
C  -0.239497 -1.850269 1.187881
H  -0.941347 0.119716 1.69047
C  0.083617 -2.363283 -1.016781
H  -0.352426 -0.847086 -2.484763
H  -0.224543 -2.197417 2.217231
H  0.372613 -3.110677 -1.749517
N  0.132252 -2.738088 0.261849
H  -1.62514 1.28471 -1.81908
totalener: -493.71664494291178 hartree
nucrepener: 522.81103821380191 hartree
electener: -1016.52766952016952 hartree
oneelecener: -1695.02721087427039 hartree
twoeener: 678.49954135410087 hartree
kineticenergy: 491.49715915481784 hartree
xcener: -46.077207961687 hartree
energy: -531.6056 -529.9110 -399.6161 -396.3687 -286.3738 -285.1136 -284.6614 -284.6214 -284.3161 -284.2721 -39.2301 -37.1910 -33.1258 -32.8100 -29.6962 -28.0453 -25.8913 -25.1521 -24.3694 -24.1026 -23.7820 -22.2850 -21.1650 -20.5440 -19.9165 -19.7649 -19.5449 -18.7454 -18.3961 -18.1312 -17.8592 -16.9103 -16.4746 -16.1183 -14.3542 -13.6586 -13.4412 -4.2624 -2.9975 -2.5450 -2.0991 -1.9749 -1.4661 -1.1071 -1.0819 -0.5229 -0.3013 -0.2163 electronvolt
chargesum: 1.0000000
charge: 0.185321 -0.478209 -0.022185 0.333044 0.237953 -0.209879 0.169059 0.213566 0.615824 0.049282 -0.058887 -0.105924 0.168996 -0.121814 0.132180 0.147345 0.149247 -0.582475 0.177558
charge: 0.023550 0.203149 0.420649 -0.213879 -0.049656 0.625410 -0.099275 -0.104298 -0.164320 0.064487 0.083241 -0.030653 0.019109 -0.022361 0.025024 0.024259 0.025042 0.115638 0.054883
qa: 0.1853 -0.4782 -0.0222 0.3330 0.2380 -0.2099 0.1691 0.2136 0.6158 0.0493 -0.0589 -0.1059 0.1690 -0.1218 0.1322 0.1473 0.1492 -0.5825 0.1776
va: 3.1523 1.9151 2.4122 0.9680 0.8627 2.2306 0.9996 0.9971 2.3784 2.7960 3.1520 3.4156 0.9878 3.4399 0.9482 0.9628 0.9564 2.1135 0.8980
dispcorr: -0.007092826 hartree
energy: -493.723737769117
