program: Gaussian 09
title: 000052742
version: EM64L-G09RevD.01
frameworkgroup: C1[X(C17H14O7)]
method: RPBEPBE
basis: SDD
operation: Freq
keyword: #pfreq=noraman
keyword: PBEPBE/SDD
title: #p freq=noraman PBEPBE/SDD
converged: YES YES NO NO
title: Mulliken charges:
elementType: O O O O O O O C C C C C C C C C C C C C C C C C H H H H H H H H H H H H H H
charge: -0.261412 -0.224594 -0.415911 -0.217868 -0.367731 -0.164872 -0.184016 -0.481912 0.068564 0.491785 0.259134 -0.442025 0.117671 -0.056513 -0.577509 0.114090 0.226117 0.141315 0.058276 0.221188 0.116876 -0.878482 -0.771060 -0.758498 0.316592 0.300287 0.289444 0.233842 0.235656 0.304957 0.288071 0.249062 0.260136 0.389604 0.257510 0.232122 0.252031 0.378074
chargesum: 0.00000
title: Mulliken charges with hydrogens summed into heavy atoms:
elementType: O O O O O O O C C C C C C C C C C C C C C C C C
charge: -0.261412 -0.224594 -0.026307 -0.217868 0.010343 -0.164872 -0.184016 -0.165320 0.068564 0.491785 0.259134 -0.141738 0.117671 -0.056513 -0.288065 0.114090 0.226117 0.141315 0.058276 0.221188 0.116876 -0.104027 0.026209 -0.016835
polarizability: 3.15526997e+02 -1.02904203e+01 2.19916050e+02 -1.85597367e+01 2.40320938e-01 1.29784315e+02
1716.lowfreq: -21.4736 -7.5279 -3.4460 -1.4869 -0.0004 0.0005 0.0007 23.1540 40.9291
frequency: -21.3768 23.1255 40.8874 61.9274 68.5989 79.5353 92.9984 120.2796 126.3496 143.4330 147.3819 162.0152 176.6193 184.2340 192.4364 234.4410 247.3259 270.4460 288.1045 299.6744 315.6450 317.6594 330.3844 353.3302 357.9941 367.6207 399.9890 426.9312 469.9681 476.6636 479.9732 501.7476 525.4203 546.8965 555.1041 567.2593 585.7378 603.6792 619.2676 654.7176 663.5577 682.2200 696.5536 741.2316 760.8160 806.4591 812.7907 836.8412 853.6080 858.1755 886.6112 921.2653 952.5138 961.0724 982.1643 1001.1830 1021.8692 1023.8294 1028.2300 1041.3627 1099.7138 1129.7734 1135.1177 1140.1070 1147.0701 1162.7756 1187.1809 1215.1721 1220.9234 1251.4148 1266.5645 1284.8183 1318.1375 1326.8991 1343.1257 1369.2758 1374.6330 1385.5819 1401.6386 1430.7226 1442.6840 1443.3850 1450.4822 1452.4252 1469.9031 1490.6913 1493.6427 1569.2257 1590.4208 1593.1157 1616.9135 1624.0432 1651.9119 1676.5880 2867.8222 2956.5501 2980.8050 2992.8759 3025.3639 3048.1990 3064.4516 3083.0339 3110.4426 3118.7739 3123.4474 3127.8545 3183.3353 3552.3988
redmass: 2.2729 6.3807 6.4476 4.5749 7.9185 4.2205 2.1720 3.4584 4.0177 1.3013 3.6598 4.8818 1.9645 1.7115 4.2643 7.1218 6.3253 4.3892 5.2379 3.4207 2.4250 3.6682 4.1384 4.7841 3.5450 4.4825 6.1890 4.7144 5.2988 6.0185 7.7028 6.3445 3.4399 4.1960 5.5150 3.9789 7.9919 5.2158 6.8120 5.7158 4.4648 5.7146 3.8365 5.6976 6.2097 2.1117 1.4982 5.1647 1.8447 3.4322 3.6550 2.7005 3.0376 3.1136 2.9534 1.9766 1.9733 1.8084 2.7428 1.4619 2.9669 1.8354 2.6123 2.4960 1.8824 1.7001 1.8223 2.1573 2.7935 2.7941 1.5968 5.1958 3.3701 2.1164 3.6388 1.2391 1.2396 2.4621 1.8986 2.6666 1.1118 1.0562 1.0660 1.0701 1.3147 1.0517 2.9821 9.3261 8.0832 10.6662 7.7959 7.7755 8.5047 9.6604 1.0777 1.0411 1.0372 1.0358 1.0984 1.0835 1.0959 1.0967 1.0924 1.0710 1.1010 1.1007 1.0936 1.0652
irintensity: 5.0291 1.3546 0.2123 4.6965 1.0538 0.4914 2.1845 4.3887 0.8803 1.3885 1.1066 4.5506 2.0330 1.0657 6.2321 5.9198 4.3398 13.1329 5.0261 8.0078 36.7074 2.5650 18.7409 5.7761 29.4253 28.1518 6.6315 12.2648 15.1563 0.4147 13.3835 7.0617 32.0933 4.5752 4.5086 19.2585 10.7485 2.2168 3.8667 2.6366 30.9274 6.3895 21.1452 18.6731 15.0213 61.0774 57.6659 24.2553 30.0350 21.6141 27.4449 19.3802 52.9878 196.4099 47.8495 35.7507 10.8906 5.8779 59.9669 2.9286 12.8265 297.7664 468.2411 12.5084 35.8969 31.2535 5.8599 114.4085 72.7398 26.7153 14.3037 16.1015 55.6357 206.8606 89.3832 43.9544 103.8288 106.9547 2.3067 2.1169 64.5156 22.1047 16.4516 25.9781 22.2934 17.4290 9.7528 385.9859 375.2378 28.9078 125.4764 453.1048 68.4545 188.3102 7.5269 36.1693 2.4414 3.0238 18.7681 0.3365 2.4207 9.7845 10.9497 655.6866 12.5651 4.3621 3.9744 54.6892
temp: 298.150 k
press: 1.00000 atm
elementType: 8 8 8 8 8 8 8 6 6 6 6 6 6 6 6 6 6 6 6 6 6 6 6 6 1 1 1 1 1 1 1 1 1 1 1 1 1 1
symmnumber: 1
zpe: 717398.1 jmol-1
zpe.correction: 0.273242 hartree
zpe.thermalcorrener: 0.295125 hartree
zpe.thermalcorrenthalpy: 0.296069 hartree
zpe.thermalcorrgfe: 0.222439 hartree
zpe.sumelectzpe: -1181.029463 hartree
zpe.sumelectthermal: -1181.007581 hartree
zpe.sumelectthermalent: -1181.006636 hartree
zpe.sumelectthermalfe: -1181.080267 hartree
dipole: 2.3081 2.5181 -3.5306
dipole: 4.9126
quadrupole: -139.9847 -141.2919 -143.5664
quadrupole: -7.4918 10.5295 3.1430
quadrupole: 1.6296 0.3224 -1.9520 -7.4918 10.5295 3.1430
hfenergy: -1181.302706 hartree
pointgroup: C01 [X(C17H14O7)]
dipole: -0.7859295 0.8819626 1.529703 debye
polarizability: 312.4886803|10.7183716|218.8946063|-30.4606775|7.1210561|133.8440755 unknown
InChI: InChI=1S/C17H14O7/c1-5-14(21)11(7(3)19)17-13(15(5)22)12-9(24-17)4-8(20)10(6(2)18)16(12)23/h4,10,12,21-22H,1-3H3
charge 0 multiplicity 1
38 atoms
O  0.360169 -1.627588 0.292193
O  -1.813302 2.463681 0.862054
O  0.842653 3.104604 0.915218
O  -4.413378 -1.589774 1.135571
O  4.666317 0.564897 -0.643614
O  -2.96534 0.83559 -1.730194
O  4.06146 -1.929971 -1.695946
C  -0.70066 0.332826 1.153439
C  0.672364 0.676863 0.607109
C  -0.871181 -1.10272 0.690923
C  -1.916467 1.203547 0.872078
C  -3.256256 0.511872 0.694366
C  1.293153 -0.518126 0.207859
C  1.395333 1.887305 0.551847
C  -2.053624 -1.781974 0.681611
C  2.613297 -0.634823 -0.258158
C  -3.293593 -1.037379 0.916904
C  2.750637 1.859105 0.122383
C  3.327749 0.616026 -0.264139
C  -3.777246 0.732049 -0.784409
C  3.222636 -1.922807 -0.754963
C  3.565065 3.13636 0.071079
C  -5.280856 0.762202 -0.927617
C  2.796038 -3.223909 -0.08106
H  -0.64778 0.319994 2.271545
H  -3.998972 0.975675 1.368153
H  -2.122131 -2.84821 0.453126
H  4.422233 3.115118 0.774434
H  3.953997 3.343166 -0.946503
H  2.93209 3.989547 0.357007
H  -5.73225 -0.067788 -0.353205
H  -5.671453 1.705054 -0.497572
H  -5.566734 0.703677 -1.988718
H  -0.167634 3.040485 0.973487
H  1.767863 -3.493775 -0.38214
H  2.796924 -3.131037 1.019721
H  3.484689 -4.023785 -0.39459
H  5.070389 1.469621 -0.626779
